null
SMILES:
InChI Key:
Activity Spreadsheet -- Enzyme Inhibition Constant Data from BindingDB
Found 1 hit for monomerid = 50574568
Trg + Lig
Ki
nM
ΔG°
kcal/mole
IC50
nM
Kd
nM
EC50/IC50
nM
koff
s-1
kon
M-1s-1
pHTemp
°C
Pannexin-1
(Mus musculus)
BDBM50574568
(CHEBI:82411 | CHEMBL3184128)
NCI pathway
Reactome pathway
n/an/a 270n/an/an/an/an/an/a
TBA
Citation and Details