null
SMILES: CN[C@@H](C)C(=O)N[C@@H](C1CCN(CC1)C(=O)c1cnc(cn1)N1CCN(CCCOc2cc3ncnc(Nc4n[nH]c(C)c4C)c3cc2S(=O)(=O)C(C)(C)C)CC1)C(=O)N1CCC[C@H]1c1nc(cs1)C(=O)c1ccc(F)cc1
InChI Key:
Activity Spreadsheet -- Enzyme Inhibition Constant Data from BindingDB
Found 3 hits for monomerid = 50574934
Trg + Lig
Ki
nM
ΔG°
kcal/mole
IC50
nM
Kd
nM
EC50/IC50
nM
koff
s-1
kon
M-1s-1
pHTemp
°C
Receptor-interacting serine/threonine-protein kinase 2
(Homo sapiens (Human))
BDBM50574934
(CHEMBL4876228)
Show SMILES CN[C@@H](C)C(=O)N[C@@H](C1CCN(CC1)C(=O)c1cnc(cn1)N1CCN(CCCOc2cc3ncnc(Nc4n[nH]c(C)c4C)c3cc2S(=O)(=O)C(C)(C)C)CC1)C(=O)N1CCC[C@H]1c1nc(cs1)C(=O)c1ccc(F)cc1 |r|
n/an/a 13n/an/an/an/an/an/a
TBA
Assay Description
Inhibition of full length His-tagged RIPK2 (unknown origin) expressed in baculovirus expression system using fluorescent labelled ATP competitive lig...
Citation and Details
Article DOI: 10.1021/acs.jmedchem.1c01118
BindingDB Entry DOI: 10.7270/Q2VD739F
Baculoviral IAP repeat-containing protein 3
(Homo sapiens (Human))
BDBM50574934
(CHEMBL4876228)
Show SMILES CN[C@@H](C)C(=O)N[C@@H](C1CCN(CC1)C(=O)c1cnc(cn1)N1CCN(CCCOc2cc3ncnc(Nc4n[nH]c(C)c4C)c3cc2S(=O)(=O)C(C)(C)C)CC1)C(=O)N1CCC[C@H]1c1nc(cs1)C(=O)c1ccc(F)cc1 |r|
n/an/a 7.90n/an/an/an/an/an/a
TBA
Assay Description
Binding affinity to human 6His-thr cIAP1 BIR3 (253 to 363) domain expressed in Escherichia coli measured after 105 mins in dark by time-resolved fluo...
Citation and Details
Article DOI: 10.1021/acs.jmedchem.1c01118
BindingDB Entry DOI: 10.7270/Q2VD739F
E3 ubiquitin-protein ligase XIAP
(Homo sapiens (Human))
BDBM50574934
(CHEMBL4876228)
Show SMILES CN[C@@H](C)C(=O)N[C@@H](C1CCN(CC1)C(=O)c1cnc(cn1)N1CCN(CCCOc2cc3ncnc(Nc4n[nH]c(C)c4C)c3cc2S(=O)(=O)C(C)(C)C)CC1)C(=O)N1CCC[C@H]1c1nc(cs1)C(=O)c1ccc(F)cc1 |r|
n/an/a 40n/an/an/an/an/an/a
TBA
Assay Description
Binding affinity to human His-thr XIAP BIR3 (241 to 356) domain expressed in Escherichia coli measured after 105 mins in dark by time-resolved fluore...
Citation and Details
Article DOI: 10.1021/acs.jmedchem.1c01118
BindingDB Entry DOI: 10.7270/Q2VD739F