null
SMILES: Cn1cc(Cc2ccc(F)cc2)c(n1)-c1cc(Cl)nc(N)n1
InChI Key:
Activity Spreadsheet -- Enzyme Inhibition Constant Data from BindingDB
Found 1 hit for monomerid = 50577234
Trg + Lig
Ki
nM
ΔG°
kcal/mole
IC50
nM
Kd
nM
EC50/IC50
nM
koff
s-1
kon
M-1s-1
pHTemp
°C
Adenylate cyclase type 10
(Homo sapiens (Human))
BDBM50577234
(CHEMBL4864843)
Show SMILES Cn1cc(Cc2ccc(F)cc2)c(n1)-c1cc(Cl)nc(N)n1
Reactome pathway
n/an/a 342n/an/an/an/an/an/a
TBA
Assay Description
Inhibition of human soluble adenylyl cyclase assessed as reduction in cAMP levels in the presence of alpha-32p labeled ATP by biochemical assay
Citation and Details
Article DOI: 10.1021/acsmedchemlett.1c00273
BindingDB Entry DOI: 10.7270/Q29S1VWQ