null
SMILES: Cc1cc(nc(N)n1)-c1nn(C)cc1Cc1cccs1
InChI Key:
Activity Spreadsheet -- Enzyme Inhibition Constant Data from BindingDB
Found 1 hit for monomerid = 50577240
Trg + Lig
Ki
nM
ΔG°
kcal/mole
IC50
nM
Kd
nM
EC50/IC50
nM
koff
s-1
kon
M-1s-1
pHTemp
°C
Adenylate cyclase type 10
(Homo sapiens (Human))
BDBM50577240
(CHEMBL4847756)
Show SMILES Cc1cc(nc(N)n1)-c1nn(C)cc1Cc1cccs1
Reactome pathway
n/an/a>1.00E+3n/an/an/an/an/an/a
TBA
Citation and Details
Article DOI: 10.1021/acsmedchemlett.1c00273
BindingDB Entry DOI: 10.7270/Q29S1VWQ