null
SMILES: Cc1c(Cc2cccc(F)c2)c(nn1C)-c1cc(Cl)nc(N)n1
InChI Key:
Activity Spreadsheet -- Enzyme Inhibition Constant Data from BindingDB
Found 1 hit for monomerid = 50577244
Trg + Lig
Ki
nM
ΔG°
kcal/mole
IC50
nM
Kd
nM
EC50/IC50
nM
koff
s-1
kon
M-1s-1
pHTemp
°C
Adenylate cyclase type 10
(Homo sapiens (Human))
BDBM50577244
(CHEMBL4864668)
Show SMILES Cc1c(Cc2cccc(F)c2)c(nn1C)-c1cc(Cl)nc(N)n1
Reactome pathway
n/an/a 126n/an/an/an/an/an/a
TBA
Citation and Details