null
SMILES: Cl.CC(C)(CCc1ccc(Cl)cc1)NCC(O)c1ccc(O)c2[nH]c(=O)ccc12
InChI Key:
Activity Spreadsheet -- Enzyme Inhibition Constant Data from BindingDB
Found 2 hits for monomerid = 50578614
Trg + Lig
Ki
nM
ΔG°
kcal/mole
IC50
nM
Kd
nM
EC50/IC50
nM
koff
s-1
kon
M-1s-1
pHTemp
°C
Beta-2 adrenergic receptor
(Homo sapiens (Human))
BDBM50578614
(CHEMBL4871708)
Show SMILES Cl.CC(C)(CCc1ccc(Cl)cc1)NCC(O)c1ccc(O)c2[nH]c(=O)ccc12
Reactome pathway
n/an/an/an/a 0.0126n/an/an/an/a
TBA
Assay Description
Agonist activity at human beta2 adrenoreceptor overexpressed in HEK293 cells assessed as cAMP accumulation
Citation and Details
Article DOI: 10.1016/j.ejmech.2021.113697
BindingDB Entry DOI: 10.7270/Q2W95F1H
Beta-1 adrenergic receptor
(Homo sapiens (Human))
BDBM50578614
(CHEMBL4871708)
Show SMILES Cl.CC(C)(CCc1ccc(Cl)cc1)NCC(O)c1ccc(O)c2[nH]c(=O)ccc12
Reactome pathway
n/an/an/an/a 3.10n/an/an/an/a
TBA
Assay Description
Agonist activity at human beta1 adrenoreceptor overexpressed in HEK293 cells assessed as cAMP accumulation
Citation and Details
Article DOI: 10.1016/j.ejmech.2021.113697
BindingDB Entry DOI: 10.7270/Q2W95F1H