null
SMILES: COc1ncc-2cc1NS(=O)(=O)c1ccc(F)c(c1)C(=O)NCc1ccc(s1)-c1ncnc3c(C)c-2sc13
InChI Key:
Activity Spreadsheet -- Enzyme Inhibition Constant Data from BindingDB
Found 10 hits for monomerid = 50579637
Trg + Lig
Ki
nM
ΔG°
kcal/mole
IC50
nM
Kd
nM
EC50/IC50
nM
koff
s-1
kon
M-1s-1
pHTemp
°C
Phosphatidylinositol 3-kinase regulatory subunit alpha/4,5-bisphosphate 3-kinase catalytic subunit delta isoform
(Homo sapiens (Human))
BDBM50579637
(CHEMBL4878958)
Show SMILES COc1ncc-2cc1NS(=O)(=O)c1ccc(F)c(c1)C(=O)NCc1ccc(s1)-c1ncnc3c(C)c-2sc13
NCI pathway
Reactome pathway
0.130n/an/an/an/an/an/an/an/a
TBA
Citation and Details
Phosphatidylinositol 4,5-bisphosphate 3-kinase catalytic subunit gamma isoform
(Homo sapiens (Human))
BDBM50579637
(CHEMBL4878958)
Show SMILES COc1ncc-2cc1NS(=O)(=O)c1ccc(F)c(c1)C(=O)NCc1ccc(s1)-c1ncnc3c(C)c-2sc13
NCI pathway
Reactome pathway
0.170n/an/an/an/an/an/an/an/a
TBA
Citation and Details
Phosphatidylinositol 3-kinase regulatory subunit alpha/4,5-bisphosphate 3-kinase catalytic subunit alpha isoform
(Homo sapiens (Human))
BDBM50579637
(CHEMBL4878958)
Show SMILES COc1ncc-2cc1NS(=O)(=O)c1ccc(F)c(c1)C(=O)NCc1ccc(s1)-c1ncnc3c(C)c-2sc13
0.270n/an/an/an/an/an/an/an/a
TBA
Citation and Details
Phosphatidylinositol 3-kinase regulatory subunit alpha/4,5-bisphosphate 3-kinase catalytic subunit beta isoform
(Homo sapiens (Human))
BDBM50579637
(CHEMBL4878958)
Show SMILES COc1ncc-2cc1NS(=O)(=O)c1ccc(F)c(c1)C(=O)NCc1ccc(s1)-c1ncnc3c(C)c-2sc13
0.310n/an/an/an/an/an/an/an/a
TBA
Citation and Details
Dual specificity protein kinase TTK
(Homo sapiens (Human))
BDBM50579637
(CHEMBL4878958)
Show SMILES COc1ncc-2cc1NS(=O)(=O)c1ccc(F)c(c1)C(=O)NCc1ccc(s1)-c1ncnc3c(C)c-2sc13
n/an/an/a 0.900n/an/an/an/an/a
TBA
Citation and Details
Serine/threonine-protein kinase mTOR
(Homo sapiens (Human))
BDBM50579637
(CHEMBL4878958)
Show SMILES COc1ncc-2cc1NS(=O)(=O)c1ccc(F)c(c1)C(=O)NCc1ccc(s1)-c1ncnc3c(C)c-2sc13
NCI pathway
Reactome pathway
n/an/a 75n/an/an/an/an/an/a
TBA
Citation and Details
Phosphatidylinositol 4,5-bisphosphate 3-kinase catalytic subunit alpha isoform
(Homo sapiens (Human))
BDBM50579637
(CHEMBL4878958)
Show SMILES COc1ncc-2cc1NS(=O)(=O)c1ccc(F)c(c1)C(=O)NCc1ccc(s1)-c1ncnc3c(C)c-2sc13
NCI pathway
Reactome pathway
n/an/a 0.130n/an/an/an/an/an/a
TBA
Citation and Details
Serine/threonine-protein kinase pim-2
(Homo sapiens (Human))
BDBM50579637
(CHEMBL4878958)
Show SMILES COc1ncc-2cc1NS(=O)(=O)c1ccc(F)c(c1)C(=O)NCc1ccc(s1)-c1ncnc3c(C)c-2sc13
n/an/a 8n/an/an/an/an/an/a
TBA
Citation and Details
Serine/threonine-protein kinase pim-3
(Homo sapiens (Human))
BDBM50579637
(CHEMBL4878958)
Show SMILES COc1ncc-2cc1NS(=O)(=O)c1ccc(F)c(c1)C(=O)NCc1ccc(s1)-c1ncnc3c(C)c-2sc13
n/an/a 5.80n/an/an/an/an/an/a
TBA
Citation and Details
Serine/threonine-protein kinase pim-1
(Homo sapiens (Human))
BDBM50579637
(CHEMBL4878958)
Show SMILES COc1ncc-2cc1NS(=O)(=O)c1ccc(F)c(c1)C(=O)NCc1ccc(s1)-c1ncnc3c(C)c-2sc13
n/an/a 22n/an/an/an/an/an/a
TBA
Citation and Details