null
SMILES: Nc1nc(SCc2ncc[nH]2)c(C#N)c(n1)-c1ccccc1
InChI Key:
Activity Spreadsheet -- Enzyme Inhibition Constant Data from BindingDB
Found 4 hits for monomerid = 50582415
Trg + Lig
Ki
nM
ΔG°
kcal/mole
IC50
nM
Kd
nM
EC50/IC50
nM
koff
s-1
kon
M-1s-1
pHTemp
°C
Adenosine receptor A2a
(Homo sapiens (Human))
BDBM50582415
(CHEMBL5093654)
Show SMILES Nc1nc(SCc2ncc[nH]2)c(C#N)c(n1)-c1ccccc1
NCI pathway
Reactome pathway
10n/an/an/an/an/an/an/an/a
TBA
Assay Description
Displacement of [3H]ZM241385 from human A2A receptor expressed in HEK293 cell membranes measured after 3 hrs by radioligand binding assay
Citation and Details
Article DOI: 10.1021/acs.jmedchem.0c01856
BindingDB Entry DOI: 10.7270/Q2PN99H7
Adenosine receptor A1
(Homo sapiens (Human))
BDBM50582415
(CHEMBL5093654)
Show SMILES Nc1nc(SCc2ncc[nH]2)c(C#N)c(n1)-c1ccccc1
Reactome pathway
69n/an/an/an/an/an/an/an/a
TBA
Assay Description
Displacement of [3H]-DPCPX from human A1 receptor expressed in CHO cell membranes measured after 3 hrs by radioligand binding assay
Citation and Details
Article DOI: 10.1021/acs.jmedchem.0c01856
BindingDB Entry DOI: 10.7270/Q2PN99H7
Adenosine receptor A3
(Homo sapiens (Human))
BDBM50582415
(CHEMBL5093654)
Show SMILES Nc1nc(SCc2ncc[nH]2)c(C#N)c(n1)-c1ccccc1
Reactome pathway
1.15E+3n/an/an/an/an/an/an/an/a
TBA
Assay Description
Displacement of [3H]PSB-11 from human A3 receptor expressed in CHO cell membranes measured after 3 hrs by radioligand binding assay
Citation and Details
Article DOI: 10.1021/acs.jmedchem.0c01856
BindingDB Entry DOI: 10.7270/Q2PN99H7
Adenosine receptor A2a
(Homo sapiens (Human))
BDBM50582415
(CHEMBL5093654)
Show SMILES Nc1nc(SCc2ncc[nH]2)c(C#N)c(n1)-c1ccccc1
NCI pathway
Reactome pathway
n/an/an/an/a 45n/an/an/an/a
TBA
Assay Description
Partial agonist activity at human A2A receptor expressed in HEK293 cell membranes assessed as intrinsic activity by measuring cell index change withi...
Citation and Details
Article DOI: 10.1021/acs.jmedchem.0c01856
BindingDB Entry DOI: 10.7270/Q2PN99H7