null
SMILES: Cc1cc2c(Oc3ccccc3F)ncnc2s1
InChI Key:
Activity Spreadsheet -- Enzyme Inhibition Constant Data from BindingDB
Found 1 hit for monomerid = 50583465
Trg + Lig
Ki
nM
ΔG°
kcal/mole
IC50
nM
Kd
nM
EC50/IC50
nM
koff
s-1
kon
M-1s-1
pHTemp
°C
Mas-related G-protein coupled receptor member X1
(Homo sapiens (Human))
BDBM50583465
(CHEMBL5078077)
Show SMILES Cc1cc2c(Oc3ccccc3F)ncnc2s1
n/an/an/an/a 1.50E+3n/an/an/an/a
TBA
Assay Description
Positive allosteric modulator activity at human MRGPRX1 transfected in HEK293 cells in presence of BAM8-22 by Fulo4AM dye based FLIPR assay
Citation and Details
Article DOI: 10.1021/acs.jmedchem.1c01709
BindingDB Entry DOI: 10.7270/Q2B28064