null
SMILES: Clc1cccc(c1)-c1c[nH]c2nccc(N3CCOCC3)c12
InChI Key:
Activity Spreadsheet -- Enzyme Inhibition Constant Data from BindingDB
Found 9 hits for monomerid = 50583973
Trg + Lig
Ki
nM
ΔG°
kcal/mole
IC50
nM
Kd
nM
EC50/IC50
nM
koff
s-1
kon
M-1s-1
pHTemp
°C
Serine/threonine-protein kinase 3
(Homo sapiens (Human))
BDBM50583973
(CHEMBL5093114)
Show SMILES Clc1cccc(c1)-c1c[nH]c2nccc(N3CCOCC3)c12
Reactome pathway
n/an/an/a 48n/an/an/an/an/a
TBA
Assay Description
Binding affinity to recombinant N-terminal His6-tagged human STK3 (18 to 311 residues) expressed in Escherichia coli assessed as dissociation constan...
Citation and Details
Article DOI: 10.1021/acs.jmedchem.1c00804
BindingDB Entry DOI: 10.7270/Q2Q52TH8
Serine/threonine-protein kinase 4
(Homo sapiens (Human))
BDBM50583973
(CHEMBL5093114)
Show SMILES Clc1cccc(c1)-c1c[nH]c2nccc(N3CCOCC3)c12
n/an/an/a 158n/an/an/an/an/a
TBA
Assay Description
Binding affinity to recombinant N-terminal His6-tagged human STK4 (43 to 431 residues) expressed in Escherichia coli assessed as dissociation constan...
Citation and Details
Article DOI: 10.1021/acs.jmedchem.1c00804
BindingDB Entry DOI: 10.7270/Q2Q52TH8
Serine/threonine-protein kinase 4
(Homo sapiens (Human))
BDBM50583973
(CHEMBL5093114)
Show SMILES Clc1cccc(c1)-c1c[nH]c2nccc(N3CCOCC3)c12
n/an/a 66n/an/an/an/an/an/a
TBA
Assay Description
Inhibition of recombinant N-terminal His6-tagged human STK4 (43 to 431 residues) expressed in Escherichia coli using myelin basic protein as substrat...
Citation and Details
Article DOI: 10.1021/acs.jmedchem.1c00804
BindingDB Entry DOI: 10.7270/Q2Q52TH8
Serine/threonine-protein kinase 3
(Homo sapiens (Human))
BDBM50583973
(CHEMBL5093114)
Show SMILES Clc1cccc(c1)-c1c[nH]c2nccc(N3CCOCC3)c12
Reactome pathway
n/an/a 119n/an/an/an/an/an/a
TBA
Assay Description
Inhibition of recombinant N-terminal His6-tagged human STK3 (18 to 311 residues) expressed in Escherichia coli using myelin basic protein as substrat...
Citation and Details
Article DOI: 10.1021/acs.jmedchem.1c00804
BindingDB Entry DOI: 10.7270/Q2Q52TH8
Leucine-rich repeat serine/threonine-protein kinase 2
(Homo sapiens (Human))
BDBM50583973
(CHEMBL5093114)
Show SMILES Clc1cccc(c1)-c1c[nH]c2nccc(N3CCOCC3)c12
n/an/a 121n/an/an/an/an/an/a
TBA
Assay Description
Displacement of K5 tracer from full length C-terminal NanoLuc fused human LRRK2 expressed in HEK293T cells incubated for 2 hrs by NanoBRET assay
Citation and Details
Article DOI: 10.1021/acs.jmedchem.1c00804
BindingDB Entry DOI: 10.7270/Q2Q52TH8
Serine/threonine-protein kinase 4
(Homo sapiens (Human))
BDBM50583973
(CHEMBL5093114)
Show SMILES Clc1cccc(c1)-c1c[nH]c2nccc(N3CCOCC3)c12
33n/an/an/an/an/an/an/an/a
TBA
Assay Description
Binding affinity to recombinant N-terminal His6-tagged human STK4 (43 to 431 residues) expressed in Escherichia coli assessed as inhibition constant
Citation and Details
Article DOI: 10.1021/acs.jmedchem.1c00804
BindingDB Entry DOI: 10.7270/Q2Q52TH8
Serine/threonine-protein kinase 3
(Homo sapiens (Human))
BDBM50583973
(CHEMBL5093114)
Show SMILES Clc1cccc(c1)-c1c[nH]c2nccc(N3CCOCC3)c12
Reactome pathway
n/an/a 373n/an/an/an/an/an/a
TBA
Assay Description
Displacement of K5 tracer from full length C-terminal NanoLuc fused human STK3 expressed in HEK293T cells incubated for 2 hrs by NanoBRET assay
Citation and Details
Article DOI: 10.1021/acs.jmedchem.1c00804
BindingDB Entry DOI: 10.7270/Q2Q52TH8
Serine/threonine-protein kinase 4
(Homo sapiens (Human))
BDBM50583973
(CHEMBL5093114)
Show SMILES Clc1cccc(c1)-c1c[nH]c2nccc(N3CCOCC3)c12
n/an/a 192n/an/an/an/an/an/a
TBA
Assay Description
Displacement of K5 tracer from full length C-terminal NanoLuc fused human STK4 expressed in HEK293T cells incubated for 2 hrs by NanoBRET assay
Citation and Details
Article DOI: 10.1021/acs.jmedchem.1c00804
BindingDB Entry DOI: 10.7270/Q2Q52TH8
Serine/threonine-protein kinase 3
(Homo sapiens (Human))
BDBM50583973
(CHEMBL5093114)
Show SMILES Clc1cccc(c1)-c1c[nH]c2nccc(N3CCOCC3)c12
Reactome pathway
211n/an/an/an/an/an/an/an/a
TBA
Assay Description
Binding affinity to recombinant N-terminal His6-tagged human STK3 (18 to 311 residues) expressed in Escherichia coli assessed as inhibition constant
Citation and Details
Article DOI: 10.1021/acs.jmedchem.1c00804
BindingDB Entry DOI: 10.7270/Q2Q52TH8