null
SMILES: CN(C)C(=O)[C@H]1CSCc2c(cccc2C(=O)OC[C@@H](NC(=O)[C@@H]2CCCN2C(C)=O)C(=O)N1)-c1ccc(s1)C(O)=O
InChI Key:
Activity Spreadsheet -- Enzyme Inhibition Constant Data from BindingDB
Found 2 hits for monomerid = 50584851
Trg + Lig
Ki
nM
ΔG°
kcal/mole
IC50
nM
Kd
nM
EC50/IC50
nM
koff
s-1
kon
M-1s-1
pHTemp
°C
Kelch-like ECH-associated protein 1
(Homo sapiens (Human))
BDBM50584851
(CHEMBL5091126)
Show SMILES CN(C)C(=O)[C@H]1CSCc2c(cccc2C(=O)OC[C@@H](NC(=O)[C@@H]2CCCN2C(C)=O)C(=O)N1)-c1ccc(s1)C(O)=O |r|
n/an/an/a 46n/an/an/an/an/a
TBA
Assay Description
Binding affinity to Keap1 (unknown origin) at R415 assessed as dissociation constant by isothermal titration calorimetry
Citation and Details
Article DOI: 10.1021/acs.jmedchem.1c01975
BindingDB Entry DOI: 10.7270/Q2FJ2MQS
Kelch-like ECH-associated protein 1
(Homo sapiens (Human))
BDBM50584851
(CHEMBL5091126)
Show SMILES CN(C)C(=O)[C@H]1CSCc2c(cccc2C(=O)OC[C@@H](NC(=O)[C@@H]2CCCN2C(C)=O)C(=O)N1)-c1ccc(s1)C(O)=O |r|
n/an/an/a 44n/an/an/an/an/a
TBA
Assay Description
Binding affinity to Keap1 (unknown origin) at R415 assessed as dissociation constant by surface plasmon resonance based inhibition-in-solution assay
Citation and Details
Article DOI: 10.1021/acs.jmedchem.1c01975
BindingDB Entry DOI: 10.7270/Q2FJ2MQS