null
SMILES: CCc1cc(O)c(F)cc1-c1cc(N(C)CCO)c2nc(N)ncc2c1
InChI Key:
Activity Spreadsheet -- Enzyme Inhibition Constant Data from BindingDB
Found 8 hits for monomerid = 50585503
Trg + Lig
Ki
nM
ΔG°
kcal/mole
IC50
nM
Kd
nM
EC50/IC50
nM
koff
s-1
kon
M-1s-1
pHTemp
°C
Aurora kinase B
(Homo sapiens (Human))
BDBM50585503
(CHEMBL5084913)
Show SMILES CCc1cc(O)c(F)cc1-c1cc(N(C)CCO)c2nc(N)ncc2c1
Reactome pathway
n/an/a 7.94E+3n/an/an/an/an/an/a
TBA
Assay Description
Inhibition of 6His tagged AURORA B (1 to 344 residue) (unknown origin) using 5FAM-GRTGRRNSI-NH2 as substrate preincubated for 30 mins followed by sub...
Citation and Details
Article DOI: 10.1021/acs.jmedchem.1c01765
BindingDB Entry DOI: 10.7270/Q25T3QDN
Tyrosine-protein kinase JAK1
(Homo sapiens (Human))
BDBM50585503
(CHEMBL5084913)
Show SMILES CCc1cc(O)c(F)cc1-c1cc(N(C)CCO)c2nc(N)ncc2c1
Reactome pathway
n/an/a 4n/an/an/an/an/an/a
TBA
Assay Description
Inhibition of GST-fused human JAK1 (854 to 1154 residues) expressed in insect cells using ULight-JAK-1 Tyr1023 peptide as substrate preincubated for ...
Citation and Details
Article DOI: 10.1021/acs.jmedchem.1c01765
BindingDB Entry DOI: 10.7270/Q25T3QDN
Tyrosine-protein kinase JAK2
(Homo sapiens (Human))
BDBM50585503
(CHEMBL5084913)
Show SMILES CCc1cc(O)c(F)cc1-c1cc(N(C)CCO)c2nc(N)ncc2c1
Reactome pathway
n/an/a 13n/an/an/an/an/an/a
TBA
Assay Description
Inhibition of GST-tagged recombinant human JAK2 (808 to 1132 residues) expressed in baculovirus expression system using ULight-JAK-1 Tyr1023 peptide ...
Citation and Details
Article DOI: 10.1021/acs.jmedchem.1c01765
BindingDB Entry DOI: 10.7270/Q25T3QDN
Non-receptor tyrosine-protein kinase TYK2/Tyrosine-protein kinase JAK1/Tyrosine-protein kinase JAK2
(Homo sapiens (Human))
BDBM50585503
(CHEMBL5084913)
Show SMILES CCc1cc(O)c(F)cc1-c1cc(N(C)CCO)c2nc(N)ncc2c1
n/an/a 158n/an/an/an/an/an/a
TBA
Assay Description
Inhibition of JAK1/JAK2/TYK1 in human lung fibroblast cells assessed as IL-13 induced eotaxin production incubated for 20 to 24 hrs by MSD assay
Citation and Details
Article DOI: 10.1021/acs.jmedchem.1c01765
BindingDB Entry DOI: 10.7270/Q25T3QDN
Non-receptor tyrosine-protein kinase TYK2
(Homo sapiens (Human))
BDBM50585503
(CHEMBL5084913)
Show SMILES CCc1cc(O)c(F)cc1-c1cc(N(C)CCO)c2nc(N)ncc2c1
n/an/a 251n/an/an/an/an/an/a
TBA
Assay Description
Inhibition of human TYK2 (888 to 1178 residues) expressed in insect cells using ULight-JAK-1 Tyr1023 peptide as substrate preincubated for 30 mins fo...
Citation and Details
Article DOI: 10.1021/acs.jmedchem.1c01765
BindingDB Entry DOI: 10.7270/Q25T3QDN
Vascular endothelial growth factor receptor 2
(Homo sapiens (Human))
BDBM50585503
(CHEMBL5084913)
Show SMILES CCc1cc(O)c(F)cc1-c1cc(N(C)CCO)c2nc(N)ncc2c1
NCI pathway
Reactome pathway
n/an/a 1.26E+3n/an/an/an/an/an/a
TBA
Assay Description
Inhibition of human GST/6His-tagged VEGFR2 using Biotin-aminohexyl-EEEEYFELVAKKKK-NH2 as substrate incubated for 90 mins in presence of ATP by TR-FRE...
Citation and Details
Article DOI: 10.1021/acs.jmedchem.1c01765
BindingDB Entry DOI: 10.7270/Q25T3QDN
JAK3/JAK1
(Homo sapiens (Human))
BDBM50585503
(CHEMBL5084913)
Show SMILES CCc1cc(O)c(F)cc1-c1cc(N(C)CCO)c2nc(N)ncc2c1
n/an/a 501n/an/an/an/an/an/a
TBA
Assay Description
Inhibition of JAK1/JAK3 signalling in human PBMC assessed as inhibition of IL-2 stimulated IFN-gamma release incubated for 1 hr followed by IL-2 stim...
Citation and Details
Article DOI: 10.1021/acs.jmedchem.1c01765
BindingDB Entry DOI: 10.7270/Q25T3QDN
Tyrosine-protein kinase JAK3
(Homo sapiens (Human))
BDBM50585503
(CHEMBL5084913)
Show SMILES CCc1cc(O)c(F)cc1-c1cc(N(C)CCO)c2nc(N)ncc2c1
Reactome pathway
n/an/a 10n/an/an/an/an/an/a
TBA
Assay Description
Inhibition of GST-fused human JAK3 (810 to 1100 residues) expressed in insect cells using ULight-JAK-1 Tyr1023 peptide as substrate preincubated for ...
Citation and Details
Article DOI: 10.1021/acs.jmedchem.1c01765
BindingDB Entry DOI: 10.7270/Q25T3QDN