null
SMILES: COC(=O)c1cccc(c1)-c1cnc2[nH]cc(-c3cncnc3)c2c1
InChI Key:
Activity Spreadsheet -- Enzyme Inhibition Constant Data from BindingDB
Found 1 hit for monomerid = 50586774
Trg + Lig
Ki
nM
ΔG°
kcal/mole
IC50
nM
Kd
nM
EC50/IC50
nM
koff
s-1
kon
M-1s-1
pHTemp
°C
Serine/threonine-protein kinase Nek1
(Homo sapiens (Human))
BDBM50586774
(CHEMBL5082392)
Show SMILES COC(=O)c1cccc(c1)-c1cnc2[nH]cc(-c3cncnc3)c2c1
n/an/a 63n/an/an/an/an/an/a
TBA
Assay Description
Inhibition of human NEK1 using myelin basic protein as substrate assessed as residual activity in presence of [gamma-33P]-ATP by radiometric hotspot ...
Citation and Details
Article DOI: 10.1016/j.bmcl.2021.128418
BindingDB Entry DOI: 10.7270/Q2QC07FN