null
SMILES: Cc1[nH]c(C(=O)Nc2cc(ccc2OCCCCCCCC(=O)NO)S(=O)(=O)N2CCOCC2)c2CCCCC(=O)c12
InChI Key:
Activity Spreadsheet -- Enzyme Inhibition Constant Data from BindingDB
Found 10 hits for monomerid = 50587252
Trg + Lig
Ki
nM
ΔG°
kcal/mole
IC50
nM
Kd
nM
EC50/IC50
nM
koff
s-1
kon
M-1s-1
pHTemp
°C
Bromodomain-containing protein 3
(Homo sapiens (Human))
BDBM50587252
(CHEMBL5083849)
Show SMILES Cc1[nH]c(C(=O)Nc2cc(ccc2OCCCCCCCC(=O)NO)S(=O)(=O)N2CCOCC2)c2CCCCC(=O)c12
n/an/an/a 37n/an/an/an/an/a
TBA
Assay Description
Binding affinity to human BRD3 domain 1 assessed as dissociation constant by isothermal titration calorimetry assay
Citation and Details
Article DOI: 10.1021/acs.jmedchem.1c01119
BindingDB Entry DOI: 10.7270/Q29Z98S3
Bromodomain-containing protein 2
(Homo sapiens (Human))
BDBM50587252
(CHEMBL5083849)
Show SMILES Cc1[nH]c(C(=O)Nc2cc(ccc2OCCCCCCCC(=O)NO)S(=O)(=O)N2CCOCC2)c2CCCCC(=O)c12
n/an/an/a 67n/an/an/an/an/a
TBA
Assay Description
Binding affinity to human BRD2 domain 2 assessed as dissociation constant by isothermal titration calorimetry assay
Citation and Details
Article DOI: 10.1021/acs.jmedchem.1c01119
BindingDB Entry DOI: 10.7270/Q29Z98S3
Bromodomain-containing protein 2
(Homo sapiens (Human))
BDBM50587252
(CHEMBL5083849)
Show SMILES Cc1[nH]c(C(=O)Nc2cc(ccc2OCCCCCCCC(=O)NO)S(=O)(=O)N2CCOCC2)c2CCCCC(=O)c12
n/an/an/a 27n/an/an/an/an/a
TBA
Assay Description
Binding affinity to human BRD2 domain 1 assessed as dissociation constant by isothermal titration calorimetry assay
Citation and Details
Article DOI: 10.1021/acs.jmedchem.1c01119
BindingDB Entry DOI: 10.7270/Q29Z98S3
Bromodomain-containing protein 4
(Homo sapiens (Human))
BDBM50587252
(CHEMBL5083849)
Show SMILES Cc1[nH]c(C(=O)Nc2cc(ccc2OCCCCCCCC(=O)NO)S(=O)(=O)N2CCOCC2)c2CCCCC(=O)c12
n/an/an/a 76n/an/an/an/an/a
TBA
Assay Description
Binding affinity to human BRD4 domain 1 (unknown origin) assessed as dissociation constant by isothermal titration calorimetry assay
Citation and Details
Article DOI: 10.1021/acs.jmedchem.1c01119
BindingDB Entry DOI: 10.7270/Q29Z98S3
Histone deacetylase 3
(Homo sapiens (Human))
BDBM50587252
(CHEMBL5083849)
Show SMILES Cc1[nH]c(C(=O)Nc2cc(ccc2OCCCCCCCC(=O)NO)S(=O)(=O)N2CCOCC2)c2CCCCC(=O)c12
NCI pathway
Reactome pathway
n/an/a 296n/an/an/an/an/an/a
TBA
Assay Description
Inhibition of human HDAC3 assessed as target activity using fluorogenic substrate ZMAL for 90 min by microplate reader at 355nm
Citation and Details
Article DOI: 10.1021/acs.jmedchem.1c01119
BindingDB Entry DOI: 10.7270/Q29Z98S3
Histone deacetylase 1
(Homo sapiens (Human))
BDBM50587252
(CHEMBL5083849)
Show SMILES Cc1[nH]c(C(=O)Nc2cc(ccc2OCCCCCCCC(=O)NO)S(=O)(=O)N2CCOCC2)c2CCCCC(=O)c12
NCI pathway
Reactome pathway
n/an/a 163n/an/an/an/an/an/a
TBA
Assay Description
Inhibition of human recombinant HDAC1 assessed as fluorescence using fluorogenic substrate ZMAL incubated for 90 min by microplate reader
Citation and Details
Article DOI: 10.1021/acs.jmedchem.1c01119
BindingDB Entry DOI: 10.7270/Q29Z98S3
Bromodomain-containing protein 3
(Homo sapiens (Human))
BDBM50587252
(CHEMBL5083849)
Show SMILES Cc1[nH]c(C(=O)Nc2cc(ccc2OCCCCCCCC(=O)NO)S(=O)(=O)N2CCOCC2)c2CCCCC(=O)c12
n/an/an/a 100n/an/an/an/an/a
TBA
Assay Description
Binding affinity to human BRD3 domain 2 assessed as dissociation constant by isothermal titration calorimetry assay
Citation and Details
Article DOI: 10.1021/acs.jmedchem.1c01119
BindingDB Entry DOI: 10.7270/Q29Z98S3
Bromodomain-containing protein 7
(Homo sapiens (Human))
BDBM50587252
(CHEMBL5083849)
Show SMILES Cc1[nH]c(C(=O)Nc2cc(ccc2OCCCCCCCC(=O)NO)S(=O)(=O)N2CCOCC2)c2CCCCC(=O)c12
n/an/an/a 125n/an/an/an/an/a
TBA
Assay Description
Binding affinity to human BRD7 assessed as dissociation constant by isothermal titration calorimetry assay
Citation and Details
Article DOI: 10.1021/acs.jmedchem.1c01119
BindingDB Entry DOI: 10.7270/Q29Z98S3
Histone deacetylase 2
(Homo sapiens (Human))
BDBM50587252
(CHEMBL5083849)
Show SMILES Cc1[nH]c(C(=O)Nc2cc(ccc2OCCCCCCCC(=O)NO)S(=O)(=O)N2CCOCC2)c2CCCCC(=O)c12
NCI pathway
Reactome pathway
n/an/a 534n/an/an/an/an/an/a
TBA
Assay Description
Inhibition of human HDAC2 assessed as target activity using fluorogenic substrate ZMAL for 90 min by microplate reader at 355nm
Citation and Details
Article DOI: 10.1021/acs.jmedchem.1c01119
BindingDB Entry DOI: 10.7270/Q29Z98S3
Histone deacetylase 6
(Homo sapiens (Human))
BDBM50587252
(CHEMBL5083849)
Show SMILES Cc1[nH]c(C(=O)Nc2cc(ccc2OCCCCCCCC(=O)NO)S(=O)(=O)N2CCOCC2)c2CCCCC(=O)c12
NCI pathway
Reactome pathway
n/an/a 67n/an/an/an/an/an/a
TBA
Assay Description
Inhibition of human recombinant HDAC6 assessed as fluorescence using fluorogenic substrate ZMAL incubated for 90 min by microplate reader
Citation and Details
Article DOI: 10.1021/acs.jmedchem.1c01119
BindingDB Entry DOI: 10.7270/Q29Z98S3