null
SMILES: COc1cc(Nc2nc(cc3c(n[nH]c23)-c2ccccc2)C#N)cc(OC)c1OC
InChI Key:
Activity Spreadsheet -- Enzyme Inhibition Constant Data from BindingDB
Found 12 hits for monomerid = 50591158
Trg + Lig
Ki
nM
ΔG°
kcal/mole
IC50
nM
Kd
nM
EC50/IC50
nM
koff
s-1
kon
M-1s-1
pHTemp
°C
Adenosine receptor A1
(Homo sapiens (Human))
BDBM50591158
(CHEMBL5181728)
Show SMILES COc1cc(Nc2nc(cc3c(n[nH]c23)-c2ccccc2)C#N)cc(OC)c1OC
Reactome pathway
4.40n/an/an/an/an/an/an/an/a
TBA
Citation and Details
Article DOI: 10.1021/acs.jmedchem.2c01123
BindingDB Entry DOI: 10.7270/Q2KP8643
Adenosine receptor A3
(Homo sapiens (Human))
BDBM50591158
(CHEMBL5181728)
Show SMILES COc1cc(Nc2nc(cc3c(n[nH]c23)-c2ccccc2)C#N)cc(OC)c1OC
Reactome pathway
9.80n/an/an/an/an/an/an/an/a
TBA
Citation and Details
Article DOI: 10.1021/acs.jmedchem.2c01123
BindingDB Entry DOI: 10.7270/Q2KP8643
Adenosine receptor A1
(Homo sapiens (Human))
BDBM50591158
(CHEMBL5181728)
Show SMILES COc1cc(Nc2nc(cc3c(n[nH]c23)-c2ccccc2)C#N)cc(OC)c1OC
Reactome pathway
n/an/a 200n/an/an/an/an/an/a
TBA
Citation and Details
Article DOI: 10.1021/acs.jmedchem.2c01123
BindingDB Entry DOI: 10.7270/Q2KP8643
Adenosine receptor A1
(Homo sapiens (Human))
BDBM50591158
(CHEMBL5181728)
Show SMILES COc1cc(Nc2nc(cc3c(n[nH]c23)-c2ccccc2)C#N)cc(OC)c1OC
Reactome pathway
n/an/an/a 7.90n/an/an/an/an/a
TBA
Citation and Details
Article DOI: 10.1021/acs.jmedchem.2c01123
BindingDB Entry DOI: 10.7270/Q2KP8643
Adenosine receptor A1
(Homo sapiens (Human))
BDBM50591158
(CHEMBL5181728)
Show SMILES COc1cc(Nc2nc(cc3c(n[nH]c23)-c2ccccc2)C#N)cc(OC)c1OC
Reactome pathway
n/an/an/a 1.70n/an/an/an/an/a
TBA
Citation and Details
Article DOI: 10.1021/acs.jmedchem.2c01123
BindingDB Entry DOI: 10.7270/Q2KP8643
Adenosine receptor A1
(Homo sapiens (Human))
BDBM50591158
(CHEMBL5181728)
Show SMILES COc1cc(Nc2nc(cc3c(n[nH]c23)-c2ccccc2)C#N)cc(OC)c1OC
Reactome pathway
n/an/an/a 13n/an/an/an/an/a
TBA
Citation and Details
Article DOI: 10.1021/acs.jmedchem.2c01123
BindingDB Entry DOI: 10.7270/Q2KP8643
Adenosine receptor A1
(Homo sapiens (Human))
BDBM50591158
(CHEMBL5181728)
Show SMILES COc1cc(Nc2nc(cc3c(n[nH]c23)-c2ccccc2)C#N)cc(OC)c1OC
Reactome pathway
n/an/an/a 23n/an/an/an/an/a
TBA
Citation and Details
Article DOI: 10.1021/acs.jmedchem.2c01123
BindingDB Entry DOI: 10.7270/Q2KP8643
Adenosine receptor A1
(Homo sapiens (Human))
BDBM50591158
(CHEMBL5181728)
Show SMILES COc1cc(Nc2nc(cc3c(n[nH]c23)-c2ccccc2)C#N)cc(OC)c1OC
Reactome pathway
n/an/an/a 3.60n/an/an/an/an/a
TBA
Citation and Details
Article DOI: 10.1021/acs.jmedchem.2c01123
BindingDB Entry DOI: 10.7270/Q2KP8643
Adenosine receptor A1
(Homo sapiens (Human))
BDBM50591158
(CHEMBL5181728)
Show SMILES COc1cc(Nc2nc(cc3c(n[nH]c23)-c2ccccc2)C#N)cc(OC)c1OC
Reactome pathway
n/an/an/a 9.30n/an/an/an/an/a
TBA
Citation and Details
Article DOI: 10.1021/acs.jmedchem.2c01123
BindingDB Entry DOI: 10.7270/Q2KP8643
Adenosine receptor A3
(Homo sapiens (Human))
BDBM50591158
(CHEMBL5181728)
Show SMILES COc1cc(Nc2nc(cc3c(n[nH]c23)-c2ccccc2)C#N)cc(OC)c1OC
Reactome pathway
n/an/an/a 13n/an/an/an/an/a
TBA
Citation and Details
Article DOI: 10.1021/acs.jmedchem.2c01123
BindingDB Entry DOI: 10.7270/Q2KP8643
Adenosine receptor A3
(Homo sapiens (Human))
BDBM50591158
(CHEMBL5181728)
Show SMILES COc1cc(Nc2nc(cc3c(n[nH]c23)-c2ccccc2)C#N)cc(OC)c1OC
Reactome pathway
n/an/a 76n/an/an/an/an/an/a
TBA
Citation and Details
Article DOI: 10.1021/acs.jmedchem.2c01123
BindingDB Entry DOI: 10.7270/Q2KP8643
Adenosine receptor A3
(Homo sapiens (Human))
BDBM50591158
(CHEMBL5181728)
Show SMILES COc1cc(Nc2nc(cc3c(n[nH]c23)-c2ccccc2)C#N)cc(OC)c1OC
Reactome pathway
n/an/an/a 10n/an/an/an/an/a
TBA
Citation and Details
Article DOI: 10.1021/acs.jmedchem.2c01123
BindingDB Entry DOI: 10.7270/Q2KP8643