null
SMILES: COc1cc(Nc2nc(CNCC3CCN(C)CC3)cc3c(n[nH]c23)-c2ccccc2)cc(OC)c1OC
InChI Key:
Activity Spreadsheet -- Enzyme Inhibition Constant Data from BindingDB
Found 7 hits for monomerid = 50591167
Trg + Lig
Ki
nM
ΔG°
kcal/mole
IC50
nM
Kd
nM
EC50/IC50
nM
koff
s-1
kon
M-1s-1
pHTemp
°C
Adenosine receptor A3
(Homo sapiens (Human))
BDBM50591167
(CHEMBL5189274)
Show SMILES COc1cc(Nc2nc(CNCC3CCN(C)CC3)cc3c(n[nH]c23)-c2ccccc2)cc(OC)c1OC
Reactome pathway
112n/an/an/an/an/an/an/an/a
TBA
Citation and Details
Article DOI: 10.1021/acs.jmedchem.2c01123
BindingDB Entry DOI: 10.7270/Q2KP8643
Adenosine receptor A1
(Homo sapiens (Human))
BDBM50591167
(CHEMBL5189274)
Show SMILES COc1cc(Nc2nc(CNCC3CCN(C)CC3)cc3c(n[nH]c23)-c2ccccc2)cc(OC)c1OC
Reactome pathway
741n/an/an/an/an/an/an/an/a
TBA
Citation and Details
Article DOI: 10.1021/acs.jmedchem.2c01123
BindingDB Entry DOI: 10.7270/Q2KP8643
Adenosine receptor A1
(Homo sapiens (Human))
BDBM50591167
(CHEMBL5189274)
Show SMILES COc1cc(Nc2nc(CNCC3CCN(C)CC3)cc3c(n[nH]c23)-c2ccccc2)cc(OC)c1OC
Reactome pathway
n/an/an/a 229n/an/an/an/an/a
TBA
Citation and Details
Article DOI: 10.1021/acs.jmedchem.2c01123
BindingDB Entry DOI: 10.7270/Q2KP8643
Adenosine receptor A3
(Homo sapiens (Human))
BDBM50591167
(CHEMBL5189274)
Show SMILES COc1cc(Nc2nc(CNCC3CCN(C)CC3)cc3c(n[nH]c23)-c2ccccc2)cc(OC)c1OC
Reactome pathway
n/an/an/a 275n/an/an/an/an/a
TBA
Citation and Details
Article DOI: 10.1021/acs.jmedchem.2c01123
BindingDB Entry DOI: 10.7270/Q2KP8643
Adenosine receptor A3
(Homo sapiens (Human))
BDBM50591167
(CHEMBL5189274)
Show SMILES COc1cc(Nc2nc(CNCC3CCN(C)CC3)cc3c(n[nH]c23)-c2ccccc2)cc(OC)c1OC
Reactome pathway
n/an/an/a 575n/an/an/an/an/a
TBA
Citation and Details
Article DOI: 10.1021/acs.jmedchem.2c01123
BindingDB Entry DOI: 10.7270/Q2KP8643
Adenosine receptor A3
(Homo sapiens (Human))
BDBM50591167
(CHEMBL5189274)
Show SMILES COc1cc(Nc2nc(CNCC3CCN(C)CC3)cc3c(n[nH]c23)-c2ccccc2)cc(OC)c1OC
Reactome pathway
n/an/a 2.80n/an/an/an/an/an/a
TBA
Citation and Details
Article DOI: 10.1021/acs.jmedchem.2c01123
BindingDB Entry DOI: 10.7270/Q2KP8643
Adenosine receptor A1
(Homo sapiens (Human))
BDBM50591167
(CHEMBL5189274)
Show SMILES COc1cc(Nc2nc(CNCC3CCN(C)CC3)cc3c(n[nH]c23)-c2ccccc2)cc(OC)c1OC
Reactome pathway
n/an/a 4.70n/an/an/an/an/an/a
TBA
Citation and Details
Article DOI: 10.1021/acs.jmedchem.2c01123
BindingDB Entry DOI: 10.7270/Q2KP8643