null
SMILES: Cn1nc(NC(=O)c2ccccc2)c2cc(Nc3ccccc3)ncc12
InChI Key:
Activity Spreadsheet -- Enzyme Inhibition Constant Data from BindingDB
Found 6 hits for monomerid = 50591170
Trg + Lig
Ki
nM
ΔG°
kcal/mole
IC50
nM
Kd
nM
EC50/IC50
nM
koff
s-1
kon
M-1s-1
pHTemp
°C
Adenosine receptor A3
(Homo sapiens (Human))
BDBM50591170
(CHEMBL5186062)
Show SMILES Cn1nc(NC(=O)c2ccccc2)c2cc(Nc3ccccc3)ncc12
Reactome pathway
234n/an/an/an/an/an/an/an/a
TBA
Citation and Details
Article DOI: 10.1021/acs.jmedchem.2c01123
BindingDB Entry DOI: 10.7270/Q2KP8643
Adenosine receptor A1
(Homo sapiens (Human))
BDBM50591170
(CHEMBL5186062)
Show SMILES Cn1nc(NC(=O)c2ccccc2)c2cc(Nc3ccccc3)ncc12
Reactome pathway
<955n/an/an/an/an/an/an/an/a
TBA
Citation and Details
Article DOI: 10.1021/acs.jmedchem.2c01123
BindingDB Entry DOI: 10.7270/Q2KP8643
Adenosine receptor A3
(Homo sapiens (Human))
BDBM50591170
(CHEMBL5186062)
Show SMILES Cn1nc(NC(=O)c2ccccc2)c2cc(Nc3ccccc3)ncc12
Reactome pathway
n/an/an/a 170n/an/an/an/an/a
TBA
Citation and Details
Article DOI: 10.1021/acs.jmedchem.2c01123
BindingDB Entry DOI: 10.7270/Q2KP8643
Adenosine receptor A1
(Homo sapiens (Human))
BDBM50591170
(CHEMBL5186062)
Show SMILES Cn1nc(NC(=O)c2ccccc2)c2cc(Nc3ccccc3)ncc12
Reactome pathway
n/an/an/a 851n/an/an/an/an/a
TBA
Citation and Details
Article DOI: 10.1021/acs.jmedchem.2c01123
BindingDB Entry DOI: 10.7270/Q2KP8643
Adenosine receptor A1
(Homo sapiens (Human))
BDBM50591170
(CHEMBL5186062)
Show SMILES Cn1nc(NC(=O)c2ccccc2)c2cc(Nc3ccccc3)ncc12
Reactome pathway
n/an/a 5n/an/an/an/an/an/a
TBA
Citation and Details
Article DOI: 10.1021/acs.jmedchem.2c01123
BindingDB Entry DOI: 10.7270/Q2KP8643
Adenosine receptor A3
(Homo sapiens (Human))
BDBM50591170
(CHEMBL5186062)
Show SMILES Cn1nc(NC(=O)c2ccccc2)c2cc(Nc3ccccc3)ncc12
Reactome pathway
n/an/a 6.80n/an/an/an/an/an/a
TBA
Citation and Details
Article DOI: 10.1021/acs.jmedchem.2c01123
BindingDB Entry DOI: 10.7270/Q2KP8643