null
SMILES: Cc1cc(ccc1OCCN1CCC=C(C1)C(O)=O)N1Nc2cc(O)ccc2-c2c1c1ccc(O)cc1oc2=O
InChI Key:
Activity Spreadsheet -- Enzyme Inhibition Constant Data from BindingDB
Found 4 hits for monomerid = 50593464
Trg + Lig
Ki
nM
ΔG°
kcal/mole
IC50
nM
Kd
nM
EC50/IC50
nM
koff
s-1
kon
M-1s-1
pHTemp
°C
Estrogen receptor
(Homo sapiens (Human))
BDBM50593464
(CHEMBL5184399)
Show SMILES Cc1cc(ccc1OCCN1CCC=C(C1)C(O)=O)N1Nc2cc(O)ccc2-c2c1c1ccc(O)cc1oc2=O |c:14|
n/an/a 0.260n/an/an/an/an/an/a
TBA
Citation and Details
Article DOI: 10.1016/j.ejmech.2021.113869
BindingDB Entry DOI: 10.7270/Q2K0788F
Progesterone receptor
(Homo sapiens (Human))
BDBM50593464
(CHEMBL5184399)
Show SMILES Cc1cc(ccc1OCCN1CCC=C(C1)C(O)=O)N1Nc2cc(O)ccc2-c2c1c1ccc(O)cc1oc2=O |c:14|
n/an/a>100n/an/an/an/an/an/a
TBA
Citation and Details
Article DOI: 10.1016/j.ejmech.2021.113869
BindingDB Entry DOI: 10.7270/Q2K0788F
Estrogen receptor
(Homo sapiens (Human))
BDBM50593464
(CHEMBL5184399)
Show SMILES Cc1cc(ccc1OCCN1CCC=C(C1)C(O)=O)N1Nc2cc(O)ccc2-c2c1c1ccc(O)cc1oc2=O |c:14|
n/an/a>100n/an/an/an/an/an/a
TBA
Citation and Details
Article DOI: 10.1016/j.ejmech.2021.113869
BindingDB Entry DOI: 10.7270/Q2K0788F
Estrogen receptor beta
(Homo sapiens (Human))
BDBM50593464
(CHEMBL5184399)
Show SMILES Cc1cc(ccc1OCCN1CCC=C(C1)C(O)=O)N1Nc2cc(O)ccc2-c2c1c1ccc(O)cc1oc2=O |c:14|
n/an/a 98n/an/an/an/an/an/a
TBA
Citation and Details
Article DOI: 10.1016/j.ejmech.2021.113869
BindingDB Entry DOI: 10.7270/Q2K0788F