null
SMILES: CS(=O)(=O)c1ccc(cc1)C(=O)Nc1cccc(Cl)c1
InChI Key:
Activity Spreadsheet -- Enzyme Inhibition Constant Data from BindingDB
Found 4 hits for monomerid = 50595382
Trg + Lig
Ki
nM
ΔG°
kcal/mole
IC50
nM
Kd
nM
EC50/IC50
nM
koff
s-1
kon
M-1s-1
pHTemp
°C
Adenosine receptor A2a
(Homo sapiens (Human))
BDBM50595382
(CHEMBL5208068)
Show SMILES CS(=O)(=O)c1ccc(cc1)C(=O)Nc1cccc(Cl)c1
NCI pathway
Reactome pathway
n/an/an/a 1.35E+4n/an/an/an/an/a
TBA
Citation and Details
Article DOI: 10.1021/acsmedchemlett.2c00099
BindingDB Entry DOI: 10.7270/Q23200WW
Adenosine receptor A3
(Homo sapiens (Human))
BDBM50595382
(CHEMBL5208068)
Show SMILES CS(=O)(=O)c1ccc(cc1)C(=O)Nc1cccc(Cl)c1
Reactome pathway
n/an/an/a 1.80E+4n/an/an/an/an/a
TBA
Citation and Details
Article DOI: 10.1021/acsmedchemlett.2c00099
BindingDB Entry DOI: 10.7270/Q23200WW
Adenosine receptor A2b
(Homo sapiens (Human))
BDBM50595382
(CHEMBL5208068)
Show SMILES CS(=O)(=O)c1ccc(cc1)C(=O)Nc1cccc(Cl)c1
NCI pathway
Reactome pathway
n/an/an/a 1.93E+4n/an/an/an/an/a
TBA
Citation and Details
Article DOI: 10.1021/acsmedchemlett.2c00099
BindingDB Entry DOI: 10.7270/Q23200WW
Adenosine receptor A1
(Homo sapiens (Human))
BDBM50595382
(CHEMBL5208068)
Show SMILES CS(=O)(=O)c1ccc(cc1)C(=O)Nc1cccc(Cl)c1
Reactome pathway
n/an/an/a 7.60E+3n/an/an/an/an/a
TBA
Citation and Details
Article DOI: 10.1021/acsmedchemlett.2c00099
BindingDB Entry DOI: 10.7270/Q23200WW