null
SMILES: O=C1NCCc2c1cc(-c1ccncc1)n2Cc1ccccc1
InChI Key:
Activity Spreadsheet -- Enzyme Inhibition Constant Data from BindingDB
Found 4 hits for monomerid = 50596596
Trg + Lig
Ki
nM
ΔG°
kcal/mole
IC50
nM
Kd
nM
EC50/IC50
nM
koff
s-1
kon
M-1s-1
pHTemp
°C
Serine/threonine-protein kinase N2
(Homo sapiens (Human))
BDBM50596596
(CHEMBL5170263)
Show SMILES O=C1NCCc2c1cc(-c1ccncc1)n2Cc1ccccc1
NCI pathway
320n/an/an/an/an/an/an/an/a
TBA
Citation and Details
Article DOI: 10.1016/j.bmcl.2022.128588
BindingDB Entry DOI: 10.7270/Q25D8WV9
Serine/threonine-protein kinase N1
(Homo sapiens (Human))
BDBM50596596
(CHEMBL5170263)
Show SMILES O=C1NCCc2c1cc(-c1ccncc1)n2Cc1ccccc1
NCI pathway
1.50E+3n/an/an/an/an/an/an/an/a
TBA
Citation and Details
Article DOI: 10.1016/j.bmcl.2022.128588
BindingDB Entry DOI: 10.7270/Q25D8WV9
Serine/threonine-protein kinase N1
(Homo sapiens (Human))
BDBM50596596
(CHEMBL5170263)
Show SMILES O=C1NCCc2c1cc(-c1ccncc1)n2Cc1ccccc1
NCI pathway
n/an/a 3.00E+3n/an/an/an/an/an/a
TBA
Citation and Details
Article DOI: 10.1016/j.bmcl.2022.128588
BindingDB Entry DOI: 10.7270/Q25D8WV9
Serine/threonine-protein kinase N2
(Homo sapiens (Human))
BDBM50596596
(CHEMBL5170263)
Show SMILES O=C1NCCc2c1cc(-c1ccncc1)n2Cc1ccccc1
NCI pathway
n/an/a 640n/an/an/an/an/an/a
TBA
Citation and Details
Article DOI: 10.1016/j.bmcl.2022.128588
BindingDB Entry DOI: 10.7270/Q25D8WV9