null
SMILES: CCn1c2CCN(C)C(=O)c2cc1-c1ccncc1
InChI Key:
Activity Spreadsheet -- Enzyme Inhibition Constant Data from BindingDB
Found 3 hits for monomerid = 50596597
Trg + Lig
Ki
nM
ΔG°
kcal/mole
IC50
nM
Kd
nM
EC50/IC50
nM
koff
s-1
kon
M-1s-1
pHTemp
°C
Serine/threonine-protein kinase N2
(Homo sapiens (Human))
BDBM50596597
(CHEMBL5182853)
Show SMILES CCn1c2CCN(C)C(=O)c2cc1-c1ccncc1
NCI pathway
170n/an/an/an/an/an/an/an/a
TBA
Citation and Details
Article DOI: 10.1016/j.bmcl.2022.128588
BindingDB Entry DOI: 10.7270/Q25D8WV9
Serine/threonine-protein kinase N1
(Homo sapiens (Human))
BDBM50596597
(CHEMBL5182853)
Show SMILES CCn1c2CCN(C)C(=O)c2cc1-c1ccncc1
NCI pathway
n/an/a>5.00E+3n/an/an/an/an/an/a
TBA
Citation and Details
Article DOI: 10.1016/j.bmcl.2022.128588
BindingDB Entry DOI: 10.7270/Q25D8WV9
Serine/threonine-protein kinase N2
(Homo sapiens (Human))
BDBM50596597
(CHEMBL5182853)
Show SMILES CCn1c2CCN(C)C(=O)c2cc1-c1ccncc1
NCI pathway
n/an/a 350n/an/an/an/an/an/a
TBA
Citation and Details
Article DOI: 10.1016/j.bmcl.2022.128588
BindingDB Entry DOI: 10.7270/Q25D8WV9