BDBM506 3-({4-[bis(4-hydroxy-2-oxo-2H-chromen-3-yl)methyl]phenyl}(4-hydroxy-2-oxo-2H-chromen-3-yl)methyl)-4-hydroxy-2H-chromen-2-one::CHEMBL293914::Cancer Chemotherapy National Service Center (CCNSC) compound 158393::NSC 158393
SMILES: Oc1c(C(c2ccc(cc2)C(c2c(O)c3ccccc3oc2=O)c2c(O)c3ccccc3oc2=O)c2c(O)c3ccccc3oc2=O)c(=O)oc2ccccc12
InChI Key: InChIKey=BXKKDJUEVYKLOT-UHFFFAOYSA-N
Data: 12 IC50
Activity Spreadsheet -- Enzyme Inhibition Constant Data from BindingDB
Found 12 hits for monomerid = 506
Trg + Lig
Ki
nM
ΔG°
kcal/mole
IC50
nM
Kd
nM
EC50/IC50
nM
koff
s-1
kon
M-1s-1
pHTemp
°C
HIV-1 Protease
(Human immunodeficiency virus type 1)
BDBM506
(3-({4-[bis(4-hydroxy-2-oxo-2H-chromen-3-yl)methyl]...)
Show SMILES Oc1c(C(c2ccc(cc2)C(c2c(O)c3ccccc3oc2=O)c2c(O)c3ccccc3oc2=O)c2c(O)c3ccccc3oc2=O)c(=O)oc2ccccc12
Show InChI InChI=1S/C44H26O12/c45-37-23-9-1-5-13-27(23)53-41(49)33(37)31(34-38(46)24-10-2-6-14-28(24)54-42(34)50)21-17-19-22(20-18-21)32(35-39(47)25-11-3-7-15-29(25)55-43(35)51)36-40(48)26-12-4-8-16-30(26)56-44(36)52/h1-20,31-32,45-48H
n/an/a 1.70E+3n/an/an/an/a6.537
National Institutes of Health
Assay Description
Sensitivity of HIV-1 protease activity to protease inhibitors was determined by a peptide substrate cleavage assay. Protease products were analyzed o...
J Med Chem 39: 2047-54 (1996)
Article DOI: 10.1021/jm950874+
BindingDB Entry DOI: 10.7270/Q2S46Q4W
Human immunodeficiency virus type 1 integrase
(Human immunodeficiency virus 1)
BDBM506
(3-({4-[bis(4-hydroxy-2-oxo-2H-chromen-3-yl)methyl]...)
Show SMILES Oc1c(C(c2ccc(cc2)C(c2c(O)c3ccccc3oc2=O)c2c(O)c3ccccc3oc2=O)c2c(O)c3ccccc3oc2=O)c(=O)oc2ccccc12
Show InChI InChI=1S/C44H26O12/c45-37-23-9-1-5-13-27(23)53-41(49)33(37)31(34-38(46)24-10-2-6-14-28(24)54-42(34)50)21-17-19-22(20-18-21)32(35-39(47)25-11-3-7-15-29(25)55-43(35)51)36-40(48)26-12-4-8-16-30(26)56-44(36)52/h1-20,31-32,45-48H
n/an/a 800n/an/an/an/an/an/a
National Cancer Institute
Curated by ChEMBL
Assay Description
Inhibitory activity against HIV-1 integrase
J Med Chem 39: 2472-81 (1996)
Article DOI: 10.1021/jm960074e
BindingDB Entry DOI: 10.7270/Q2DR2W5P
Human immunodeficiency virus type 1 integrase
(Human immunodeficiency virus 1)
BDBM506
(3-({4-[bis(4-hydroxy-2-oxo-2H-chromen-3-yl)methyl]...)
Show SMILES Oc1c(C(c2ccc(cc2)C(c2c(O)c3ccccc3oc2=O)c2c(O)c3ccccc3oc2=O)c2c(O)c3ccccc3oc2=O)c(=O)oc2ccccc12
Show InChI InChI=1S/C44H26O12/c45-37-23-9-1-5-13-27(23)53-41(49)33(37)31(34-38(46)24-10-2-6-14-28(24)54-42(34)50)21-17-19-22(20-18-21)32(35-39(47)25-11-3-7-15-29(25)55-43(35)51)36-40(48)26-12-4-8-16-30(26)56-44(36)52/h1-20,31-32,45-48H
n/an/a 800n/an/an/an/an/an/a
National Cancer Institute
Curated by ChEMBL
Assay Description
Inhibitory concentration against purified recombinant integrase by strand transfer in vitro assay
J Med Chem 40: 930-6 (1997)
Article DOI: 10.1021/jm960754h
BindingDB Entry DOI: 10.7270/Q24X56VR
Human immunodeficiency virus type 1 integrase
(Human immunodeficiency virus 1)
BDBM506
(3-({4-[bis(4-hydroxy-2-oxo-2H-chromen-3-yl)methyl]...)
Show SMILES Oc1c(C(c2ccc(cc2)C(c2c(O)c3ccccc3oc2=O)c2c(O)c3ccccc3oc2=O)c2c(O)c3ccccc3oc2=O)c(=O)oc2ccccc12
Show InChI InChI=1S/C44H26O12/c45-37-23-9-1-5-13-27(23)53-41(49)33(37)31(34-38(46)24-10-2-6-14-28(24)54-42(34)50)21-17-19-22(20-18-21)32(35-39(47)25-11-3-7-15-29(25)55-43(35)51)36-40(48)26-12-4-8-16-30(26)56-44(36)52/h1-20,31-32,45-48H
n/an/a 1.50E+3n/an/an/an/an/an/a
National Cancer Institute
Curated by ChEMBL
Assay Description
Inhibitory concentration against purified recombinant integrase by 3'-processing in vitro assay
J Med Chem 40: 930-6 (1997)
Article DOI: 10.1021/jm960754h
BindingDB Entry DOI: 10.7270/Q24X56VR
Human immunodeficiency virus type 1 integrase
(Human immunodeficiency virus 1)
BDBM506
(3-({4-[bis(4-hydroxy-2-oxo-2H-chromen-3-yl)methyl]...)
Show SMILES Oc1c(C(c2ccc(cc2)C(c2c(O)c3ccccc3oc2=O)c2c(O)c3ccccc3oc2=O)c2c(O)c3ccccc3oc2=O)c(=O)oc2ccccc12
Show InChI InChI=1S/C44H26O12/c45-37-23-9-1-5-13-27(23)53-41(49)33(37)31(34-38(46)24-10-2-6-14-28(24)54-42(34)50)21-17-19-22(20-18-21)32(35-39(47)25-11-3-7-15-29(25)55-43(35)51)36-40(48)26-12-4-8-16-30(26)56-44(36)52/h1-20,31-32,45-48H
n/an/a 800n/an/an/an/an/an/a
National Cancer Institute
Curated by ChEMBL
Assay Description
Integration of DNA by HIV -1 integrase
J Med Chem 40: 242-9 (1997)
Article DOI: 10.1021/jm960450v
BindingDB Entry DOI: 10.7270/Q2DN444V
DNA topoisomerase I (Topo I)
(Homo sapiens (Human))
BDBM506
(3-({4-[bis(4-hydroxy-2-oxo-2H-chromen-3-yl)methyl]...)
Show SMILES Oc1c(C(c2ccc(cc2)C(c2c(O)c3ccccc3oc2=O)c2c(O)c3ccccc3oc2=O)c2c(O)c3ccccc3oc2=O)c(=O)oc2ccccc12
Show InChI InChI=1S/C44H26O12/c45-37-23-9-1-5-13-27(23)53-41(49)33(37)31(34-38(46)24-10-2-6-14-28(24)54-42(34)50)21-17-19-22(20-18-21)32(35-39(47)25-11-3-7-15-29(25)55-43(35)51)36-40(48)26-12-4-8-16-30(26)56-44(36)52/h1-20,31-32,45-48H
n/an/a 1.00E+4n/an/an/an/an/an/a
National Cancer Institute
Curated by ChEMBL
Assay Description
Inhibitory activity against topoisomerase I.
J Med Chem 39: 2472-81 (1996)
Article DOI: 10.1021/jm960074e
BindingDB Entry DOI: 10.7270/Q2DR2W5P
NAD(P)H dehydrogenase [quinone] 1
(Homo sapiens (Human))
BDBM506
(3-({4-[bis(4-hydroxy-2-oxo-2H-chromen-3-yl)methyl]...)
Show SMILES Oc1c(C(c2ccc(cc2)C(c2c(O)c3ccccc3oc2=O)c2c(O)c3ccccc3oc2=O)c2c(O)c3ccccc3oc2=O)c(=O)oc2ccccc12
Show InChI InChI=1S/C44H26O12/c45-37-23-9-1-5-13-27(23)53-41(49)33(37)31(34-38(46)24-10-2-6-14-28(24)54-42(34)50)21-17-19-22(20-18-21)32(35-39(47)25-11-3-7-15-29(25)55-43(35)51)36-40(48)26-12-4-8-16-30(26)56-44(36)52/h1-20,31-32,45-48H
Reactome pathway
n/an/a 2.00E+4n/an/an/an/an/an/a
University of Manchester
Curated by ChEMBL
Assay Description
Inhibition of human recombinant NQO1 in presence of BSA
J Med Chem 50: 6316-25 (2007)
Article DOI: 10.1021/jm070472p
BindingDB Entry DOI: 10.7270/Q2DV1JM1
NAD(P)H dehydrogenase [quinone] 1
(Homo sapiens (Human))
BDBM506
(3-({4-[bis(4-hydroxy-2-oxo-2H-chromen-3-yl)methyl]...)
Show SMILES Oc1c(C(c2ccc(cc2)C(c2c(O)c3ccccc3oc2=O)c2c(O)c3ccccc3oc2=O)c2c(O)c3ccccc3oc2=O)c(=O)oc2ccccc12
Show InChI InChI=1S/C44H26O12/c45-37-23-9-1-5-13-27(23)53-41(49)33(37)31(34-38(46)24-10-2-6-14-28(24)54-42(34)50)21-17-19-22(20-18-21)32(35-39(47)25-11-3-7-15-29(25)55-43(35)51)36-40(48)26-12-4-8-16-30(26)56-44(36)52/h1-20,31-32,45-48H
Reactome pathway
n/an/a 110n/an/an/an/an/an/a
University of Manchester
Curated by ChEMBL
Assay Description
Inhibition of human recombinant NQO1
J Med Chem 50: 6316-25 (2007)
Article DOI: 10.1021/jm070472p
BindingDB Entry DOI: 10.7270/Q2DV1JM1
Human immunodeficiency virus type 1 protease
(Human immunodeficiency virus type 1)
BDBM506
(3-({4-[bis(4-hydroxy-2-oxo-2H-chromen-3-yl)methyl]...)
Show SMILES Oc1c(C(c2ccc(cc2)C(c2c(O)c3ccccc3oc2=O)c2c(O)c3ccccc3oc2=O)c2c(O)c3ccccc3oc2=O)c(=O)oc2ccccc12
Show InChI InChI=1S/C44H26O12/c45-37-23-9-1-5-13-27(23)53-41(49)33(37)31(34-38(46)24-10-2-6-14-28(24)54-42(34)50)21-17-19-22(20-18-21)32(35-39(47)25-11-3-7-15-29(25)55-43(35)51)36-40(48)26-12-4-8-16-30(26)56-44(36)52/h1-20,31-32,45-48H
n/an/a 1.70E+3n/an/an/an/an/an/a
National Cancer Institute
Curated by ChEMBL
Assay Description
Inhibitory activity against HIV-1 Protease.
J Med Chem 39: 2472-81 (1996)
Article DOI: 10.1021/jm960074e
BindingDB Entry DOI: 10.7270/Q2DR2W5P
Human immunodeficiency virus type 2 integrase
(Human immunodeficiency virus 2)
BDBM506
(3-({4-[bis(4-hydroxy-2-oxo-2H-chromen-3-yl)methyl]...)
Show SMILES Oc1c(C(c2ccc(cc2)C(c2c(O)c3ccccc3oc2=O)c2c(O)c3ccccc3oc2=O)c2c(O)c3ccccc3oc2=O)c(=O)oc2ccccc12
Show InChI InChI=1S/C44H26O12/c45-37-23-9-1-5-13-27(23)53-41(49)33(37)31(34-38(46)24-10-2-6-14-28(24)54-42(34)50)21-17-19-22(20-18-21)32(35-39(47)25-11-3-7-15-29(25)55-43(35)51)36-40(48)26-12-4-8-16-30(26)56-44(36)52/h1-20,31-32,45-48H
n/an/a 1.00E+3n/an/an/an/an/an/a
National Cancer Institute
Curated by ChEMBL
Assay Description
Inhibitory activity against HIV-2 Integrase was measured using 3'-processing (3'-proc) assay.
J Med Chem 39: 2472-81 (1996)
Article DOI: 10.1021/jm960074e
BindingDB Entry DOI: 10.7270/Q2DR2W5P
Human immunodeficiency virus type 1 integrase
(Human immunodeficiency virus 1)
BDBM506
(3-({4-[bis(4-hydroxy-2-oxo-2H-chromen-3-yl)methyl]...)
Show SMILES Oc1c(C(c2ccc(cc2)C(c2c(O)c3ccccc3oc2=O)c2c(O)c3ccccc3oc2=O)c2c(O)c3ccccc3oc2=O)c(=O)oc2ccccc12
Show InChI InChI=1S/C44H26O12/c45-37-23-9-1-5-13-27(23)53-41(49)33(37)31(34-38(46)24-10-2-6-14-28(24)54-42(34)50)21-17-19-22(20-18-21)32(35-39(47)25-11-3-7-15-29(25)55-43(35)51)36-40(48)26-12-4-8-16-30(26)56-44(36)52/h1-20,31-32,45-48H
n/an/a 1.50E+3n/an/an/an/an/an/a
National Cancer Institute
Curated by ChEMBL
Assay Description
Inhibitory activity against HIV-1 integrase
J Med Chem 39: 2472-81 (1996)
Article DOI: 10.1021/jm960074e
BindingDB Entry DOI: 10.7270/Q2DR2W5P
Human immunodeficiency virus type 1 integrase
(Human immunodeficiency virus 1)
BDBM506
(3-({4-[bis(4-hydroxy-2-oxo-2H-chromen-3-yl)methyl]...)
Show SMILES Oc1c(C(c2ccc(cc2)C(c2c(O)c3ccccc3oc2=O)c2c(O)c3ccccc3oc2=O)c2c(O)c3ccccc3oc2=O)c(=O)oc2ccccc12
Show InChI InChI=1S/C44H26O12/c45-37-23-9-1-5-13-27(23)53-41(49)33(37)31(34-38(46)24-10-2-6-14-28(24)54-42(34)50)21-17-19-22(20-18-21)32(35-39(47)25-11-3-7-15-29(25)55-43(35)51)36-40(48)26-12-4-8-16-30(26)56-44(36)52/h1-20,31-32,45-48H
n/an/a 1.50E+3n/an/an/an/an/an/a
National Cancer Institute
Curated by ChEMBL
Assay Description
Inhibitory activity against 3'-processing of DNA by HIV-1 integrase
J Med Chem 40: 242-9 (1997)
Article DOI: 10.1021/jm960450v
BindingDB Entry DOI: 10.7270/Q2DN444V