null
SMILES: COC(=O)C1(CNC2CCOCC2)CN(C1)c1ccc(cc1)N1c2cc(Cl)ccc2-c2cc(Cl)cnc2C(C)(C)C1=O
InChI Key:
Activity Spreadsheet -- Enzyme Inhibition Constant Data from BindingDB
Found 1 hit for monomerid = 50600477
Trg + Lig
Ki
nM
ΔG°
kcal/mole
IC50
nM
Kd
nM
EC50/IC50
nM
koff
s-1
kon
M-1s-1
pHTemp
°C
Parathyroid hormone/parathyroid hormone-related peptide receptor
(Homo sapiens (Human))
BDBM50600477
(CHEMBL5191139)
Show SMILES COC(=O)C1(CNC2CCOCC2)CN(C1)c1ccc(cc1)N1c2cc(Cl)ccc2-c2cc(Cl)cnc2C(C)(C)C1=O
Reactome pathway
n/an/a 110n/an/an/an/an/an/a
TBA
Citation and Details
Article DOI: 10.1016/j.bmc.2022.116763
BindingDB Entry DOI: 10.7270/Q2280CPH