null
SMILES: CC1(C)c2ncc(Cl)cc2-c2ccc(Cl)cc2N(c2ccc(cc2)N2CC(F)(CNC34CCC(CC3)(CC4)C(O)=O)C2)C1=O
InChI Key:
Activity Spreadsheet -- Enzyme Inhibition Constant Data from BindingDB
Found 1 hit for monomerid = 50600486
Trg + Lig
Ki
nM
ΔG°
kcal/mole
IC50
nM
Kd
nM
EC50/IC50
nM
koff
s-1
kon
M-1s-1
pHTemp
°C
Parathyroid hormone/parathyroid hormone-related peptide receptor
(Homo sapiens (Human))
BDBM50600486
(CHEMBL5201635)
Show SMILES CC1(C)c2ncc(Cl)cc2-c2ccc(Cl)cc2N(c2ccc(cc2)N2CC(F)(CNC34CCC(CC3)(CC4)C(O)=O)C2)C1=O
Reactome pathway
n/an/a 90n/an/an/an/an/an/a
TBA
Citation and Details
Article DOI: 10.1016/j.bmc.2022.116763
BindingDB Entry DOI: 10.7270/Q2280CPH