null
SMILES: CCc1cc2ncc(CN3CC4CN(CC4C3)c3ccc(nc3)C(=O)NC)cc2[nH]c1=O
InChI Key:
Activity Spreadsheet -- Enzyme Inhibition Constant Data from BindingDB
Found 4 hits for monomerid = 50602040
Trg + Lig
Ki
nM
ΔG°
kcal/mole
IC50
nM
Kd
nM
EC50/IC50
nM
koff
s-1
kon
M-1s-1
pHTemp
°C
Poly [ADP-ribose] polymerase 1
(Homo sapiens (Human))
BDBM50602040
(CHEMBL5180001)
Show SMILES CCc1cc2ncc(CN3CC4CN(CC4C3)c3ccc(nc3)C(=O)NC)cc2[nH]c1=O
n/an/a 0.340n/an/an/an/an/an/a
TBA
Citation and Details
Article DOI: 10.1016/j.bmcl.2022.129046
BindingDB Entry DOI: 10.7270/Q2V41095
Poly [ADP-ribose] polymerase 2
(Homo sapiens (Human))
BDBM50602040
(CHEMBL5180001)
Show SMILES CCc1cc2ncc(CN3CC4CN(CC4C3)c3ccc(nc3)C(=O)NC)cc2[nH]c1=O
n/an/a 678n/an/an/an/an/an/a
TBA
Citation and Details
Article DOI: 10.1016/j.bmcl.2022.129046
BindingDB Entry DOI: 10.7270/Q2V41095
Poly [ADP-ribose] polymerase 1
(Homo sapiens (Human))
BDBM50602040
(CHEMBL5180001)
Show SMILES CCc1cc2ncc(CN3CC4CN(CC4C3)c3ccc(nc3)C(=O)NC)cc2[nH]c1=O
n/an/a 8.10n/an/an/an/an/an/a
TBA
Citation and Details
Article DOI: 10.1016/j.bmcl.2022.129046
BindingDB Entry DOI: 10.7270/Q2V41095
Poly [ADP-ribose] polymerase 2
(Homo sapiens (Human))
BDBM50602040
(CHEMBL5180001)
Show SMILES CCc1cc2ncc(CN3CC4CN(CC4C3)c3ccc(nc3)C(=O)NC)cc2[nH]c1=O
n/an/a 18n/an/an/an/an/an/a
TBA
Citation and Details
Article DOI: 10.1016/j.bmcl.2022.129046
BindingDB Entry DOI: 10.7270/Q2V41095