null
SMILES: CN1CCN(CC1)S(=O)(=O)c1ccc(cc1)-c1ccnc2[nH]ccc12
InChI Key:
Activity Spreadsheet -- Enzyme Inhibition Constant Data from BindingDB
Found 1 hit for monomerid = 50603398
Trg + Lig
Ki
nM
ΔG°
kcal/mole
IC50
nM
Kd
nM
EC50/IC50
nM
koff
s-1
kon
M-1s-1
pHTemp
°C
Serine/threonine-protein kinase Nek1
(Homo sapiens (Human))
BDBM50603398
(CHEMBL5172286)
Show SMILES CN1CCN(CC1)S(=O)(=O)c1ccc(cc1)-c1ccnc2[nH]ccc12
n/an/a>1.00E+4n/an/an/an/an/an/a
TBA
Citation and Details
Article DOI: 10.1021/acs.jmedchem.0c02118
BindingDB Entry DOI: 10.7270/Q2RV0SSW