null
SMILES: OC[C@H](Cc1ccccc1)NS(=O)(=O)c1ccc(cc1)-c1ccnc2[nH]ccc12
InChI Key:
Activity Spreadsheet -- Enzyme Inhibition Constant Data from BindingDB
Found 1 hit for monomerid = 50603404
Trg + Lig
Ki
nM
ΔG°
kcal/mole
IC50
nM
Kd
nM
EC50/IC50
nM
koff
s-1
kon
M-1s-1
pHTemp
°C
Serine/threonine-protein kinase Nek1
(Homo sapiens (Human))
BDBM50603404
(CHEMBL5174141)
Show SMILES OC[C@H](Cc1ccccc1)NS(=O)(=O)c1ccc(cc1)-c1ccnc2[nH]ccc12 |r|
n/an/a 1.90E+3n/an/an/an/an/an/a
TBA
Citation and Details
Article DOI: 10.1021/acs.jmedchem.0c02118
BindingDB Entry DOI: 10.7270/Q2RV0SSW