null
SMILES: [O-][n+]1c(nc2ccc(Cl)cn12)-c1ccc(Br)cc1
InChI Key:
Activity Spreadsheet -- Enzyme Inhibition Constant Data from BindingDB
Found 1 hit for monomerid = 50603539
Trg + Lig
Ki
nM
ΔG°
kcal/mole
IC50
nM
Kd
nM
EC50/IC50
nM
koff
s-1
kon
M-1s-1
pHTemp
°C
Aryl hydrocarbon receptor
(Homo sapiens (Human))
BDBM50603539
(CHEMBL5021347)
Show SMILES [O-][n+]1c(nc2ccc(Cl)cn12)-c1ccc(Br)cc1
n/an/an/an/a 0.340n/an/an/an/a
TBA
Citation and Details
Article DOI: 10.1016/j.ejmech.2022.114122
BindingDB Entry DOI: 10.7270/Q2BP06WR