null
SMILES: CC(C)c1c(O)cc(\C=C\c2ccccc2)cc1O
InChI Key:
Activity Spreadsheet -- Enzyme Inhibition Constant Data from BindingDB
Found 1 hit for monomerid = 50603566
Trg + Lig
Ki
nM
ΔG°
kcal/mole
IC50
nM
Kd
nM
EC50/IC50
nM
koff
s-1
kon
M-1s-1
pHTemp
°C
Aryl hydrocarbon receptor
(Homo sapiens (Human))
BDBM50603566
(Benvitimod | GSK-2894512 | GSK2894512 | TAPINAROF ...)
Show SMILES CC(C)c1c(O)cc(\C=C\c2ccccc2)cc1O
n/an/an/an/a 27n/an/an/an/a
TBA
Citation and Details
Article DOI: 10.1016/j.ejmech.2022.114122
BindingDB Entry DOI: 10.7270/Q2BP06WR