null
SMILES: FC(F)(F)c1cccc(c1)S(=O)(=O)N1CCc2cc(ccc12)C1CC1NCC1CCNCC1
InChI Key:
Activity Spreadsheet -- Enzyme Inhibition Constant Data from BindingDB
Found 4 hits for monomerid = 50603924
Trg + Lig
Ki
nM
ΔG°
kcal/mole
IC50
nM
Kd
nM
EC50/IC50
nM
koff
s-1
kon
M-1s-1
pHTemp
°C
Lysine-specific histone demethylase 1A
(Homo sapiens (Human))
BDBM50603924
(CHEMBL5196564)
Show SMILES FC(F)(F)c1cccc(c1)S(=O)(=O)N1CCc2cc(ccc12)C1CC1NCC1CCNCC1
Reactome pathway
n/an/a 3.95E+4n/an/an/an/an/an/a
TBA
Citation and Details
Article DOI: 10.1021/acs.jmedchem.1c02156
BindingDB Entry DOI: 10.7270/Q2154N4T
Amine oxidase [flavin-containing] B
(Homo sapiens (Human))
BDBM50603924
(CHEMBL5196564)
Show SMILES FC(F)(F)c1cccc(c1)S(=O)(=O)N1CCc2cc(ccc12)C1CC1NCC1CCNCC1
n/an/a 8.62E+4n/an/an/an/an/an/a
TBA
Citation and Details
Article DOI: 10.1021/acs.jmedchem.1c02156
BindingDB Entry DOI: 10.7270/Q2154N4T
Amine oxidase [flavin-containing] A
(Homo sapiens (Human))
BDBM50603924
(CHEMBL5196564)
Show SMILES FC(F)(F)c1cccc(c1)S(=O)(=O)N1CCc2cc(ccc12)C1CC1NCC1CCNCC1
n/an/a 4.98E+4n/an/an/an/an/an/a
TBA
Citation and Details
Article DOI: 10.1021/acs.jmedchem.1c02156
BindingDB Entry DOI: 10.7270/Q2154N4T
Lysine-specific histone demethylase 2
(Homo sapiens (Human))
BDBM50603924
(CHEMBL5196564)
Show SMILES FC(F)(F)c1cccc(c1)S(=O)(=O)N1CCc2cc(ccc12)C1CC1NCC1CCNCC1
Reactome pathway
n/an/a 1.02E+3n/an/an/an/an/an/a
TBA
Citation and Details
Article DOI: 10.1021/acs.jmedchem.1c02156
BindingDB Entry DOI: 10.7270/Q2154N4T