null
SMILES: CC(C)n1c(C)nc2c(F)cc(cc12)-c1nc(Nc2ccc(CNC(=O)CC(=O)NO)cc2)ncc1F
InChI Key:
Activity Spreadsheet -- Enzyme Inhibition Constant Data from BindingDB
Found 5 hits for monomerid = 50606473
Trg + Lig
Ki
nM
ΔG°
kcal/mole
IC50
nM
Kd
nM
EC50/IC50
nM
koff
s-1
kon
M-1s-1
pHTemp
°C
Histone deacetylase 1
(Homo sapiens (Human))
BDBM50606473
(CHEMBL5220945)
Show SMILES CC(C)n1c(C)nc2c(F)cc(cc12)-c1nc(Nc2ccc(CNC(=O)CC(=O)NO)cc2)ncc1F
NCI pathway
Reactome pathway
n/an/a 26n/an/an/an/an/an/a
TBA
Citation and Details
Article DOI: 10.1016/j.ejmech.2020.112904
BindingDB Entry DOI: 10.7270/Q2XP791Q
Histone deacetylase 6
(Homo sapiens (Human))
BDBM50606473
(CHEMBL5220945)
Show SMILES CC(C)n1c(C)nc2c(F)cc(cc12)-c1nc(Nc2ccc(CNC(=O)CC(=O)NO)cc2)ncc1F
NCI pathway
Reactome pathway
n/an/a 5.90n/an/an/an/an/an/a
TBA
Citation and Details
Article DOI: 10.1016/j.ejmech.2020.112904
BindingDB Entry DOI: 10.7270/Q2XP791Q
Cyclin-dependent kinase 4
(Homo sapiens (Human))
BDBM50606473
(CHEMBL5220945)
Show SMILES CC(C)n1c(C)nc2c(F)cc(cc12)-c1nc(Nc2ccc(CNC(=O)CC(=O)NO)cc2)ncc1F
NCI pathway
Reactome pathway
n/an/a 1.20n/an/an/an/an/an/a
TBA
Citation and Details
Article DOI: 10.1016/j.ejmech.2020.112904
BindingDB Entry DOI: 10.7270/Q2XP791Q
Polyamine deacetylase HDAC10
(Homo sapiens (Human))
BDBM50606473
(CHEMBL5220945)
Show SMILES CC(C)n1c(C)nc2c(F)cc(cc12)-c1nc(Nc2ccc(CNC(=O)CC(=O)NO)cc2)ncc1F
NCI pathway
Reactome pathway
n/an/a 73n/an/an/an/an/an/a
TBA
Citation and Details
Article DOI: 10.1016/j.ejmech.2020.112904
BindingDB Entry DOI: 10.7270/Q2XP791Q
Histone deacetylase 3
(Homo sapiens (Human))
BDBM50606473
(CHEMBL5220945)
Show SMILES CC(C)n1c(C)nc2c(F)cc(cc12)-c1nc(Nc2ccc(CNC(=O)CC(=O)NO)cc2)ncc1F
NCI pathway
Reactome pathway
n/an/a 56n/an/an/an/an/an/a
TBA
Citation and Details
Article DOI: 10.1016/j.ejmech.2020.112904
BindingDB Entry DOI: 10.7270/Q2XP791Q