null
SMILES: Cn1cc(Cc2ccccc2OCCN2CCOCC2)c(n1)-c1cc(Cl)nc(N)n1
InChI Key:
Activity Spreadsheet -- Enzyme Inhibition Constant Data from BindingDB
Found 1 hit for monomerid = 50607672
Trg + Lig
Ki
nM
ΔG°
kcal/mole
IC50
nM
Kd
nM
EC50/IC50
nM
koff
s-1
kon
M-1s-1
pHTemp
°C
Adenylate cyclase type 10
(Homo sapiens (Human))
BDBM50607672
(CHEMBL5220723)
Show SMILES Cn1cc(Cc2ccccc2OCCN2CCOCC2)c(n1)-c1cc(Cl)nc(N)n1
Reactome pathway
n/an/a 12n/an/an/an/an/an/a
TBA
Citation and Details
Article DOI: 10.1021/acs.jmedchem.2c01133
BindingDB Entry DOI: 10.7270/Q2057M2B