BDBM51064 3-Benzoyl-5-(4-chloro-phenyl)-1-phenyl-3a,6a-dihydro-1H-pyrrolo[3,4-c]pyrazole-4,6-dione::3-benzoyl-5-(4-chlorophenyl)-1-phenyl-3a,6a-dihydropyrrolo[3,4-c]pyrazole-4,6-dione::3-benzoyl-5-(4-chlorophenyl)-1-phenyl-3a,6a-dihydropyrrolo[3,4-c]pyrazole-4,6-quinone::5-(4-chlorophenyl)-1-phenyl-3-(phenylcarbonyl)-3a,6a-dihydropyrrolo[3,4-c]pyrazole-4,6-dione::MLS000588814::SMR000212366::cid_3362974
SMILES: Oc1n(-c2ccc(Cl)cc2)c(=O)c2c([nH]n(-c3ccccc3)c12)C(=O)c1ccccc1
InChI Key: InChIKey=UTMKJKUMNVRLJL-UHFFFAOYSA-N
Data: 3 IC50
Activity Spreadsheet -- Enzyme Inhibition Constant Data from BindingDB
Found 3 hits for monomerid = 51064
Trg + Lig
Ki
nM
ΔG°
kcal/mole
IC50
nM
Kd
nM
EC50/IC50
nM
koff
s-1
kon
M-1s-1
pHTemp
°C
BZLF2
(Human herpesvirus 4 type 2)
BDBM51064
(3-Benzoyl-5-(4-chloro-phenyl)-1-phenyl-3a,6a-dihyd...)
Show SMILES Oc1n(-c2ccc(Cl)cc2)c(=O)c2c([nH]n(-c3ccccc3)c12)C(=O)c1ccccc1
Show InChI InChI=1S/C24H16ClN3O3/c25-16-11-13-17(14-12-16)27-23(30)19-20(22(29)15-7-3-1-4-8-15)26-28(21(19)24(27)31)18-9-5-2-6-10-18/h1-14,26,31H
PCBioAssay
n/an/a 1.85E+3n/an/an/an/an/an/a
Emory University Molecular Libraries Screening Center
Curated by PubChem BioAssay
Assay Description
NIH Molecular Libraries Screening Centers Network [MLSCN] Emory Chemical Biology Discovery Center in MLSCN Assay provider: Theodore Jardetzky; Northw...
PubChem Bioassay (2008)
BindingDB Entry DOI: 10.7270/Q2057DCW
Beta lactamase
(Pseudomonas aeruginosa)
BDBM51064
(3-Benzoyl-5-(4-chloro-phenyl)-1-phenyl-3a,6a-dihyd...)
Show SMILES Oc1n(-c2ccc(Cl)cc2)c(=O)c2c([nH]n(-c3ccccc3)c12)C(=O)c1ccccc1
Show InChI InChI=1S/C24H16ClN3O3/c25-16-11-13-17(14-12-16)27-23(30)19-20(22(29)15-7-3-1-4-8-15)26-28(21(19)24(27)31)18-9-5-2-6-10-18/h1-14,26,31H
PCBioAssay
n/an/a 1.18E+4n/an/an/an/an/an/a
The Scripps Research Institute Molecular Screening Center
Curated by PubChem BioAssay
Assay Description
Source (MLPCN Center Name): The Scripps Research Institute Molecular Screening Center (SRIMSC) Affiliation: The Scripps Research Institute, TSRI Assa...
PubChem Bioassay (2011)
BindingDB Entry DOI: 10.7270/Q2G15ZB8
Toll-like receptor 9
(Homo sapiens (Human))
BDBM51064
(3-Benzoyl-5-(4-chloro-phenyl)-1-phenyl-3a,6a-dihyd...)
Show SMILES Oc1n(-c2ccc(Cl)cc2)c(=O)c2c([nH]n(-c3ccccc3)c12)C(=O)c1ccccc1
Show InChI InChI=1S/C24H16ClN3O3/c25-16-11-13-17(14-12-16)27-23(30)19-20(22(29)15-7-3-1-4-8-15)26-28(21(19)24(27)31)18-9-5-2-6-10-18/h1-14,26,31H
PCBioAssay
n/an/a 1.16E+4n/an/an/an/an/an/a
The Scripps Research Institute Molecular Screening Center
Curated by PubChem BioAssay
Assay Description
Source (MLPCN Center Name): The Scripps Research Institute Molecular Screening Center (SRIMSC) Affiliation: The Scripps Research Institute, TSRI Assa...
PubChem Bioassay (2011)
BindingDB Entry DOI: 10.7270/Q2KS6Q2P