BDBM5112 N-(3,4-Dimethyl-5-isopropyl-1,3-thiazol-2(3H)-ylidene)-3-nitrobenzenesulfonamide::N-[(2Z)-3,4-dimethyl-5-(propan-2-yl)-2,3-dihydro-1,3-thiazol-2-ylidene]-3-nitrobenzene-1-sulfonamide::thiazolidenebenzenesulfonamide deriv. 17e
SMILES: CC(C)c1s\c(=N/S(=O)(=O)c2cccc(c2)[N+]([O-])=O)n(C)c1C
InChI Key: InChIKey=BUKUBFLNNJJJAO-PFONDFGASA-N
Data: 4 IC50
Activity Spreadsheet -- Enzyme Inhibition Constant Data from BindingDB
Found 4 hits for monomerid = 5112
Trg + Lig
Ki
nM
ΔG°
kcal/mole
IC50
nM
Kd
nM
EC50/IC50
nM
koff
s-1
kon
M-1s-1
pHTemp
°C
HIV-1 Reverse Transcriptase
(Human immunodeficiency virus type 1)
BDBM5112
(N-(3,4-Dimethyl-5-isopropyl-1,3-thiazol-2(3H)-ylid...)
Show SMILES CC(C)c1s\c(=N/S(=O)(=O)c2cccc(c2)[N+]([O-])=O)n(C)c1C
Show InChI InChI=1S/C14H17N3O4S2/c1-9(2)13-10(3)16(4)14(22-13)15-23(20,21)12-7-5-6-11(8-12)17(18)19/h5-9H,1-4H3/b15-14-
n/an/a 340n/an/an/an/a8.437
Yamanouchi Pharmaceutical Co. Ltd
Assay Description
The IC50 of reverse transcriptase is the concentration that inhibits 50% of recombinant HIV-1 RT RNA-directed DNA polymerase activity in vitro.
Bioorg Med Chem 12: 6171-82 (2004)
Article DOI: 10.1016/j.bmc.2004.08.050
BindingDB Entry DOI: 10.7270/Q23R0R24
Reverse Transcriptase
(Human immunodeficiency virus 1)
BDBM5112
(N-(3,4-Dimethyl-5-isopropyl-1,3-thiazol-2(3H)-ylid...)
Show SMILES CC(C)c1s\c(=N/S(=O)(=O)c2cccc(c2)[N+]([O-])=O)n(C)c1C
Show InChI InChI=1S/C14H17N3O4S2/c1-9(2)13-10(3)16(4)14(22-13)15-23(20,21)12-7-5-6-11(8-12)17(18)19/h5-9H,1-4H3/b15-14-
n/an/a 2.00E+4n/an/an/an/an/an/a
Korea Institute of Science and Technology
Curated by ChEMBL
Assay Description
Inhibition of HIV1 reverse transcriptase K103N mutant by HeLa-MAGI assay
Bioorg Med Chem Lett 18: 1181-94 (2008)
Article DOI: 10.1016/j.bmcl.2007.11.134
BindingDB Entry DOI: 10.7270/Q2NS0XPK
HIV-1 Reverse Transcriptase Mutant (Y181C)
(Human immunodeficiency virus type 1)
BDBM5112
(N-(3,4-Dimethyl-5-isopropyl-1,3-thiazol-2(3H)-ylid...)
Show SMILES CC(C)c1s\c(=N/S(=O)(=O)c2cccc(c2)[N+]([O-])=O)n(C)c1C
Show InChI InChI=1S/C14H17N3O4S2/c1-9(2)13-10(3)16(4)14(22-13)15-23(20,21)12-7-5-6-11(8-12)17(18)19/h5-9H,1-4H3/b15-14-
n/an/a 71n/an/an/an/a8.437
Yamanouchi Pharmaceutical Co. Ltd
Assay Description
The IC50 of reverse transcriptase is the concentration that inhibits 50% of recombinant HIV-1 RT RNA-directed DNA polymerase activity in vitro.
Bioorg Med Chem 12: 6171-82 (2004)
Article DOI: 10.1016/j.bmc.2004.08.050
BindingDB Entry DOI: 10.7270/Q23R0R24
HIV-1 Reverse Transcriptase Mutant (K103N)
(Human immunodeficiency virus type 1)
BDBM5112
(N-(3,4-Dimethyl-5-isopropyl-1,3-thiazol-2(3H)-ylid...)
Show SMILES CC(C)c1s\c(=N/S(=O)(=O)c2cccc(c2)[N+]([O-])=O)n(C)c1C
Show InChI InChI=1S/C14H17N3O4S2/c1-9(2)13-10(3)16(4)14(22-13)15-23(20,21)12-7-5-6-11(8-12)17(18)19/h5-9H,1-4H3/b15-14-
n/an/a 2.00E+4n/an/an/an/a8.437
Yamanouchi Pharmaceutical Co. Ltd
Assay Description
The IC50 of reverse transcriptase is the concentration that inhibits 50% of recombinant HIV-1 RT RNA-directed DNA polymerase activity in vitro.
Bioorg Med Chem 12: 6171-82 (2004)
Article DOI: 10.1016/j.bmc.2004.08.050
BindingDB Entry DOI: 10.7270/Q23R0R24