null
SMILES: CC(C)Nc1ccc(Nc2ccnc3cc4ccccc4cc23)cc1
InChI Key: InChIKey=ZKHLFXGNCPJHKW-UHFFFAOYSA-N
Activity Spreadsheet -- Enzyme Inhibition Constant Data from BindingDB
Found 3 hits for monomerid = 51365
Trg + Lig
Ki
nM
ΔG°
kcal/mole
IC50
nM
Kd
nM
EC50/IC50
nM
koff
s-1
kon
M-1s-1
pHTemp
°C
DNA repair protein RAD51 homolog 1
(Homo sapiens (Human))
BDBM51365
(1-N-benzo[g]quinolin-4-yl-4-N-propan-2-ylbenzene-1...)
Show SMILES CC(C)Nc1ccc(Nc2ccnc3cc4ccccc4cc23)cc1
Show InChI InChI=1S/C22H21N3/c1-15(2)24-18-7-9-19(10-8-18)25-21-11-12-23-22-14-17-6-4-3-5-16(17)13-20(21)22/h3-15,24H,1-2H3,(H,23,25)
Reactome pathway
PCBioAssay
n/an/a 5.30E+4n/an/an/an/an/an/a
PCMD
Curated by PubChem BioAssay
Assay Description
Project Title: A screen for modulators of human Rad51, a key DNA repair protein Application Number: MH084119 Assay Submitter: Dr. Alex Mazin Submitte...
PubChem Bioassay (2008)
BindingDB Entry DOI: 10.7270/Q2QN6558
DNA polymerase
(Vaccinia virus (strain WR))
BDBM51365
(1-N-benzo[g]quinolin-4-yl-4-N-propan-2-ylbenzene-1...)
Show SMILES CC(C)Nc1ccc(Nc2ccnc3cc4ccccc4cc23)cc1
Show InChI InChI=1S/C22H21N3/c1-15(2)24-18-7-9-19(10-8-18)25-21-11-12-23-22-14-17-6-4-3-5-16(17)13-20(21)22/h3-15,24H,1-2H3,(H,23,25)
US Patent
n/an/a 4.10E+3n/an/an/an/a7.437
The Trustees of the University of Pennsylvania
US Patent
Assay Description
A rapid plate DNA synthesis assay was performed using optimized conditions. Briefly, a 1.2:1 ratio of a 20-mer oligonucleotide primer (5′-GCGAA...
US Patent US9211296 (2015)
BindingDB Entry DOI: 10.7270/Q2G73CHS
Neurotensin receptor type 1
(Homo sapiens (Human))
BDBM51365
(1-N-benzo[g]quinolin-4-yl-4-N-propan-2-ylbenzene-1...)
Show SMILES CC(C)Nc1ccc(Nc2ccnc3cc4ccccc4cc23)cc1
Show InChI InChI=1S/C22H21N3/c1-15(2)24-18-7-9-19(10-8-18)25-21-11-12-23-22-14-17-6-4-3-5-16(17)13-20(21)22/h3-15,24H,1-2H3,(H,23,25)
Reactome pathway
PCBioAssay
n/an/an/an/a 1.22E+4n/an/an/an/a
Burnham Center for Chemical Genomics
Curated by PubChem BioAssay
Assay Description
Data Source: Sanford-Burnham Center for Chemical Genomics (SBCCG) Source Affiliation: Sanford-Burnham Medical Research Institute (SBMRI, San Diego, C...
PubChem Bioassay (2011)
BindingDB Entry DOI: 10.7270/Q22N50RJ