BDBM5143 (5Z)-4-(2,3-dihydro-1H-inden-5-ylamino)-5-{[3-methyl-5-(morpholin-4-ylcarbonyl)-1H-pyrrol-2-yl]methylidene}-5H,6H,7H-pyrrolo[2,3-d]pyrimidin-6-one::pyrrolo[2,3-d]pyrimidin-6-one deriv. 28a
SMILES: Cc1cc([nH]c1\C=C1/C(=O)Nc2ncnc(Nc3ccc4CCCc4c3)c12)C(=O)N1CCOCC1
InChI Key: InChIKey=OZSZUGKQFYJEMK-UYRXBGFRSA-N
Data: 3 IC50
Activity Spreadsheet -- Enzyme Inhibition Constant Data from BindingDB
Found 3 hits for monomerid = 5143
Trg + Lig
Ki
nM
ΔG°
kcal/mole
IC50
nM
Kd
nM
EC50/IC50
nM
koff
s-1
kon
M-1s-1
pHTemp
°C
Vascular endothelial growth factor receptor 2
(Homo sapiens (Human))
BDBM5143
((5Z)-4-(2,3-dihydro-1H-inden-5-ylamino)-5-{[3-meth...)
Show SMILES Cc1cc([nH]c1\C=C1/C(=O)Nc2ncnc(Nc3ccc4CCCc4c3)c12)C(=O)N1CCOCC1
Show InChI InChI=1S/C26H26N6O3/c1-15-11-21(26(34)32-7-9-35-10-8-32)30-20(15)13-19-22-23(27-14-28-24(22)31-25(19)33)29-18-6-5-16-3-2-4-17(16)12-18/h5-6,11-14,30H,2-4,7-10H2,1H3,(H2,27,28,29,31,33)/b19-13-
NCI pathway
Reactome pathway
n/an/a 3.46E+3n/an/an/an/an/an/a
SUGEN, Inc.
Assay Description
The assays were performed in 96-well microtiter plates that had been coated with a polyGluTyr peptide. Negative control wells received buffer alone w...
Bioorg Med Chem Lett 12: 2153-7 (2002)
Article DOI: 10.1016/s0960-894x(02)00364-5
BindingDB Entry DOI: 10.7270/Q200009N
Platelet-derived growth factor receptor beta
(Homo sapiens (Human))
BDBM5143
((5Z)-4-(2,3-dihydro-1H-inden-5-ylamino)-5-{[3-meth...)
Show SMILES Cc1cc([nH]c1\C=C1/C(=O)Nc2ncnc(Nc3ccc4CCCc4c3)c12)C(=O)N1CCOCC1
Show InChI InChI=1S/C26H26N6O3/c1-15-11-21(26(34)32-7-9-35-10-8-32)30-20(15)13-19-22-23(27-14-28-24(22)31-25(19)33)29-18-6-5-16-3-2-4-17(16)12-18/h5-6,11-14,30H,2-4,7-10H2,1H3,(H2,27,28,29,31,33)/b19-13-
NCI pathway
Reactome pathway
n/an/a>2.00E+4n/an/an/an/an/an/a
SUGEN, Inc.
Assay Description
IC50 is the inhibitor concentration which inhibits 50% of EGF-R or PDGFR-beta kinase autophosphorylation activity. The assay was performed in 96-well...
Bioorg Med Chem Lett 12: 2153-7 (2002)
Article DOI: 10.1016/s0960-894x(02)00364-5
BindingDB Entry DOI: 10.7270/Q200009N
Epidermal growth factor receptor
(Homo sapiens (Human))
BDBM5143
((5Z)-4-(2,3-dihydro-1H-inden-5-ylamino)-5-{[3-meth...)
Show SMILES Cc1cc([nH]c1\C=C1/C(=O)Nc2ncnc(Nc3ccc4CCCc4c3)c12)C(=O)N1CCOCC1
Show InChI InChI=1S/C26H26N6O3/c1-15-11-21(26(34)32-7-9-35-10-8-32)30-20(15)13-19-22-23(27-14-28-24(22)31-25(19)33)29-18-6-5-16-3-2-4-17(16)12-18/h5-6,11-14,30H,2-4,7-10H2,1H3,(H2,27,28,29,31,33)/b19-13-
n/an/a 1.41E+3n/an/an/an/an/an/a
SUGEN, Inc.
Assay Description
IC50 is the inhibitor concentration which inhibits 50% of EGF-R or PDGFR-beta kinase autophosphorylation activity. The assay was performed in 96-well...
Bioorg Med Chem Lett 12: 2153-7 (2002)
Article DOI: 10.1016/s0960-894x(02)00364-5
BindingDB Entry DOI: 10.7270/Q200009N