null
SMILES: N[C@H](C(=O)N1CCC[C@H]1B(O)O)C1(CC1)C(F)(F)F
InChI Key:
Activity Spreadsheet -- Enzyme Inhibition Constant Data from BindingDB
Found 18 hits for monomerid = 514530
Trg + Lig
Ki
nM
ΔG°
kcal/mole
IC50
nM
Kd
nM
EC50/IC50
nM
koff
s-1
kon
M-1s-1
pHTemp
°C
Dipeptidyl peptidase 8
(Homo sapiens (Human))
BDBM514530
(US11096924, DASH-inhibitors 4949)
Show SMILES N[C@H](C(=O)N1CCC[C@H]1B(O)O)C1(CC1)C(F)(F)F |r|
n/an/a 2.40E+4n/an/an/an/an/an/a
TBA
Citation and Details
BindingDB Entry DOI: 10.7270/Q2RB77SR
Presequence protease, mitochondrial (PREP)
(Homo sapiens (Human))
US11583516, Cmpd ID 4949
(US11096924, DASH-inhibitors 4949)
Show SMILES N[C@H](C(=O)N1CCC[C@H]1B(O)O)C1(CC1)C(F)(F)F |r|
n/an/a 58n/an/an/an/an/an/a
TBA
Citation and Details
Dipeptidyl peptidase 4
(Homo sapiens (Human))
BDBM514530
(US11096924, DASH-inhibitors 4949)
Show SMILES N[C@H](C(=O)N1CCC[C@H]1B(O)O)C1(CC1)C(F)(F)F |r|
Reactome pathway
n/an/a 2.20E+4n/an/an/an/an/an/a
TBA
Citation and Details
BindingDB Entry DOI: 10.7270/Q2RB77SR
Dipeptidyl peptidase 2
(Homo sapiens (Human))
BDBM514530
(US11096924, DASH-inhibitors 4949)
Show SMILES N[C@H](C(=O)N1CCC[C@H]1B(O)O)C1(CC1)C(F)(F)F |r|
n/an/a 3.90E+4n/an/an/an/an/an/a
TBA
Citation and Details
BindingDB Entry DOI: 10.7270/Q2RB77SR
Prolyl endopeptidase FAP
(Homo sapiens (Human))
BDBM514530
(US11096924, DASH-inhibitors 4949)
Show SMILES N[C@H](C(=O)N1CCC[C@H]1B(O)O)C1(CC1)C(F)(F)F |r|
n/an/a 1.20E+6n/an/an/an/an/an/a
TBA
Citation and Details
BindingDB Entry DOI: 10.7270/Q2RB77SR
Homeobox protein PKNOX1
(Human)
BDBM514530
(US11096924, DASH-inhibitors 4949)
Show SMILES N[C@H](C(=O)N1CCC[C@H]1B(O)O)C1(CC1)C(F)(F)F |r|
n/an/a 5.80E+4n/an/an/an/an/an/a
TBA
Citation and Details
BindingDB Entry DOI: 10.7270/Q2RB77SR
Dipeptidyl peptidase 8
(Homo sapiens (Human))
US11559537, Compound 4949
(US11096924, DASH-inhibitors 4949)
Show SMILES N[C@H](C(=O)N1CCC[C@H]1B(O)O)C1(CC1)C(F)(F)F |r|
n/an/a 24n/an/an/an/an/an/a
TBA
Citation and Details
Dipeptidyl peptidase 9
(Homo sapiens (Human))
US11559537, Compound 4949
(US11096924, DASH-inhibitors 4949)
Show SMILES N[C@H](C(=O)N1CCC[C@H]1B(O)O)C1(CC1)C(F)(F)F |r|
n/an/a 19n/an/an/an/an/an/a
TBA
Citation and Details
Dipeptidyl peptidase 4
(Homo sapiens (Human))
US11559537, Compound 4949
(US11096924, DASH-inhibitors 4949)
Show SMILES N[C@H](C(=O)N1CCC[C@H]1B(O)O)C1(CC1)C(F)(F)F |r|
Reactome pathway
n/an/a 22n/an/an/an/an/an/a
TBA
Citation and Details
Dipeptidyl peptidase 2
(Homo sapiens (Human))
US11559537, Compound 4949
(US11096924, DASH-inhibitors 4949)
Show SMILES N[C@H](C(=O)N1CCC[C@H]1B(O)O)C1(CC1)C(F)(F)F |r|
n/an/a 39n/an/an/an/an/an/a
TBA
Citation and Details
Prolyl endopeptidase FAP
(Homo sapiens (Human))
US11559537, Compound 4949
(US11096924, DASH-inhibitors 4949)
Show SMILES N[C@H](C(=O)N1CCC[C@H]1B(O)O)C1(CC1)C(F)(F)F |r|
n/an/a 1.20E+3n/an/an/an/an/an/a
TBA
Citation and Details
Prolyl endopeptidase
(Homo sapiens (Human))
US11559537, Compound 4949
(US11096924, DASH-inhibitors 4949)
Show SMILES N[C@H](C(=O)N1CCC[C@H]1B(O)O)C1(CC1)C(F)(F)F |r|
n/an/a 58n/an/an/an/an/an/a
TBA
Citation and Details
Dipeptidyl peptidase 8
(Homo sapiens (Human))
US11583516, Cmpd ID 4949
(US11096924, DASH-inhibitors 4949)
Show SMILES N[C@H](C(=O)N1CCC[C@H]1B(O)O)C1(CC1)C(F)(F)F |r|
n/an/a 24n/an/an/an/an/an/a
TBA
Citation and Details
Dipeptidyl peptidase 9
(Homo sapiens (Human))
US11583516, Cmpd ID 4949
(US11096924, DASH-inhibitors 4949)
Show SMILES N[C@H](C(=O)N1CCC[C@H]1B(O)O)C1(CC1)C(F)(F)F |r|
n/an/a 19n/an/an/an/an/an/a
TBA
Citation and Details
Dipeptidyl peptidase 4
(Homo sapiens (Human))
US11583516, Cmpd ID 4949
(US11096924, DASH-inhibitors 4949)
Show SMILES N[C@H](C(=O)N1CCC[C@H]1B(O)O)C1(CC1)C(F)(F)F |r|
Reactome pathway
n/an/a 22n/an/an/an/an/an/a
TBA
Citation and Details
Dipeptidyl peptidase 2
(Homo sapiens (Human))
US11583516, Cmpd ID 4949
(US11096924, DASH-inhibitors 4949)
Show SMILES N[C@H](C(=O)N1CCC[C@H]1B(O)O)C1(CC1)C(F)(F)F |r|
n/an/a 39n/an/an/an/an/an/a
TBA
Citation and Details
Prolyl endopeptidase FAP
(Homo sapiens (Human))
US11583516, Cmpd ID 4949
(US11096924, DASH-inhibitors 4949)
Show SMILES N[C@H](C(=O)N1CCC[C@H]1B(O)O)C1(CC1)C(F)(F)F |r|
n/an/a 1.20E+3n/an/an/an/an/an/a
TBA
Citation and Details
Dipeptidyl peptidase 9
(Homo sapiens (Human))
BDBM514530
(US11096924, DASH-inhibitors 4949)
Show SMILES N[C@H](C(=O)N1CCC[C@H]1B(O)O)C1(CC1)C(F)(F)F |r|
n/an/a 1.90E+4n/an/an/an/an/an/a
TBA
Citation and Details
BindingDB Entry DOI: 10.7270/Q2RB77SR