null
SMILES: CC1(CC1)[C@H](N)C(=O)N1CCC[C@H]1B(O)O
InChI Key:
Activity Spreadsheet -- Enzyme Inhibition Constant Data from BindingDB
Found 21 hits for monomerid = 514555
Trg + Lig
Ki
nM
ΔG°
kcal/mole
IC50
nM
Kd
nM
EC50/IC50
nM
koff
s-1
kon
M-1s-1
pHTemp
°C
Dipeptidyl peptidase 8
(Homo sapiens (Human))
BDBM514555
(US11096924, DASH-inhibitors 4367)
Show SMILES CC1(CC1)[C@H](N)C(=O)N1CCC[C@H]1B(O)O |r|
n/an/a 5.60E+3n/an/an/an/an/an/a
TBA
Citation and Details
BindingDB Entry DOI: 10.7270/Q2RB77SR
Dipeptidyl peptidase 8/9
(Homo sapiens (Human))
US11583516, Cmpd ID 4367
(US11096924, DASH-inhibitors 4367)
Show SMILES CC1(CC1)[C@H](N)C(=O)N1CCC[C@H]1B(O)O |r|
n/an/a 55n/an/an/an/an/an/a
TBA
Citation and Details
Dipeptidyl peptidase 4
(Homo sapiens (Human))
BDBM514555
(US11096924, DASH-inhibitors 4367)
Show SMILES CC1(CC1)[C@H](N)C(=O)N1CCC[C@H]1B(O)O |r|
Reactome pathway
n/an/a 1.40E+3n/an/an/an/an/an/a
TBA
Citation and Details
BindingDB Entry DOI: 10.7270/Q2RB77SR
Dipeptidyl peptidase 2
(Homo sapiens (Human))
BDBM514555
(US11096924, DASH-inhibitors 4367)
Show SMILES CC1(CC1)[C@H](N)C(=O)N1CCC[C@H]1B(O)O |r|
n/an/a 3.40E+4n/an/an/an/an/an/a
TBA
Citation and Details
BindingDB Entry DOI: 10.7270/Q2RB77SR
Prolyl endopeptidase FAP
(Homo sapiens (Human))
BDBM514555
(US11096924, DASH-inhibitors 4367)
Show SMILES CC1(CC1)[C@H](N)C(=O)N1CCC[C@H]1B(O)O |r|
n/an/a 3.50E+5n/an/an/an/an/an/a
TBA
Citation and Details
BindingDB Entry DOI: 10.7270/Q2RB77SR
Homeobox protein PKNOX1
(Human)
BDBM514555
(US11096924, DASH-inhibitors 4367)
Show SMILES CC1(CC1)[C@H](N)C(=O)N1CCC[C@H]1B(O)O |r|
n/an/a 2.00E+5n/an/an/an/an/an/a
TBA
Citation and Details
BindingDB Entry DOI: 10.7270/Q2RB77SR
Dipeptidyl peptidase 8/9
(Homo sapiens (Human))
BDBM514555
(US11096924, DASH-inhibitors 4367)
Show SMILES CC1(CC1)[C@H](N)C(=O)N1CCC[C@H]1B(O)O |r|
n/an/a 5.50E+4n/an/an/an/an/an/a
TBA
Citation and Details
BindingDB Entry DOI: 10.7270/Q2RB77SR
Dipeptidyl peptidase 8
(Homo sapiens (Human))
US11559537, Compound 4367
(US11096924, DASH-inhibitors 4367)
Show SMILES CC1(CC1)[C@H](N)C(=O)N1CCC[C@H]1B(O)O |r|
n/an/a 5.60n/an/an/an/an/an/a
TBA
Citation and Details
Dipeptidyl peptidase 9
(Homo sapiens (Human))
US11559537, Compound 4367
(US11096924, DASH-inhibitors 4367)
Show SMILES CC1(CC1)[C@H](N)C(=O)N1CCC[C@H]1B(O)O |r|
n/an/a 1.5n/an/an/an/an/an/a
TBA
Citation and Details
Dipeptidyl peptidase 4
(Homo sapiens (Human))
US11559537, Compound 4367
(US11096924, DASH-inhibitors 4367)
Show SMILES CC1(CC1)[C@H](N)C(=O)N1CCC[C@H]1B(O)O |r|
Reactome pathway
n/an/a 1.40n/an/an/an/an/an/a
TBA
Citation and Details
Dipeptidyl peptidase 2
(Homo sapiens (Human))
US11559537, Compound 4367
(US11096924, DASH-inhibitors 4367)
Show SMILES CC1(CC1)[C@H](N)C(=O)N1CCC[C@H]1B(O)O |r|
n/an/a 34n/an/an/an/an/an/a
TBA
Citation and Details
Prolyl endopeptidase FAP
(Homo sapiens (Human))
US11559537, Compound 4367
(US11096924, DASH-inhibitors 4367)
Show SMILES CC1(CC1)[C@H](N)C(=O)N1CCC[C@H]1B(O)O |r|
n/an/a 350n/an/an/an/an/an/a
TBA
Citation and Details
Prolyl endopeptidase
(Homo sapiens (Human))
US11559537, Compound 4367
(US11096924, DASH-inhibitors 4367)
Show SMILES CC1(CC1)[C@H](N)C(=O)N1CCC[C@H]1B(O)O |r|
n/an/a 200n/an/an/an/an/an/a
TBA
Citation and Details
Dipeptidyl peptidase 8/9
(Homo sapiens (Human))
US11559537, Compound 4367
(US11096924, DASH-inhibitors 4367)
Show SMILES CC1(CC1)[C@H](N)C(=O)N1CCC[C@H]1B(O)O |r|
n/an/a 55n/an/an/an/an/an/a
TBA
Citation and Details
Dipeptidyl peptidase 8
(Homo sapiens (Human))
US11583516, Cmpd ID 4367
(US11096924, DASH-inhibitors 4367)
Show SMILES CC1(CC1)[C@H](N)C(=O)N1CCC[C@H]1B(O)O |r|
n/an/a 5.60n/an/an/an/an/an/a
TBA
Citation and Details
Dipeptidyl peptidase 9
(Homo sapiens (Human))
US11583516, Cmpd ID 4367
(US11096924, DASH-inhibitors 4367)
Show SMILES CC1(CC1)[C@H](N)C(=O)N1CCC[C@H]1B(O)O |r|
n/an/a 1.5n/an/an/an/an/an/a
TBA
Citation and Details
Dipeptidyl peptidase 4
(Homo sapiens (Human))
US11583516, Cmpd ID 4367
(US11096924, DASH-inhibitors 4367)
Show SMILES CC1(CC1)[C@H](N)C(=O)N1CCC[C@H]1B(O)O |r|
Reactome pathway
n/an/a 1.40n/an/an/an/an/an/a
TBA
Citation and Details
Dipeptidyl peptidase 2
(Homo sapiens (Human))
US11583516, Cmpd ID 4367
(US11096924, DASH-inhibitors 4367)
Show SMILES CC1(CC1)[C@H](N)C(=O)N1CCC[C@H]1B(O)O |r|
n/an/a 34n/an/an/an/an/an/a
TBA
Citation and Details
Prolyl endopeptidase FAP
(Homo sapiens (Human))
US11583516, Cmpd ID 4367
(US11096924, DASH-inhibitors 4367)
Show SMILES CC1(CC1)[C@H](N)C(=O)N1CCC[C@H]1B(O)O |r|
n/an/a 350n/an/an/an/an/an/a
TBA
Citation and Details
Presequence protease, mitochondrial (PREP)
(Homo sapiens (Human))
US11583516, Cmpd ID 4367
(US11096924, DASH-inhibitors 4367)
Show SMILES CC1(CC1)[C@H](N)C(=O)N1CCC[C@H]1B(O)O |r|
n/an/a 200n/an/an/an/an/an/a
TBA
Citation and Details
Dipeptidyl peptidase 9
(Homo sapiens (Human))
BDBM514555
(US11096924, DASH-inhibitors 4367)
Show SMILES CC1(CC1)[C@H](N)C(=O)N1CCC[C@H]1B(O)O |r|
n/an/a 1.50E+3n/an/an/an/an/an/a
TBA
Citation and Details
BindingDB Entry DOI: 10.7270/Q2RB77SR