BDBM51853 1-[3-[(6,7-dimethoxy-1-methyl-3,4-dihydro-1H-isoquinolin-2-yl)methyl]-4-methoxy-phenyl]-2,3,4,9-tetrahydro-1H-beta-carboline::1-[3-[(6,7-dimethoxy-1-methyl-3,4-dihydro-1H-isoquinolin-2-yl)methyl]-4-methoxy-phenyl]-2,3,4,9-tetrahydro-1H-pyrido[3,4-b]indole::1-[3-[(6,7-dimethoxy-1-methyl-3,4-dihydro-1H-isoquinolin-2-yl)methyl]-4-methoxyphenyl]-2,3,4,9-tetrahydro-1H-pyrido[3,4-b]indole::1-{3-[(6,7-dimethoxy-1-methyl-3,4-dihydroisoquinolin-2(1H)-yl)methyl]-4-methoxyphenyl}-2,3,4,9-tetrahydro-1H-beta-carboline::MLS000686796::SMR000339802::cid_3458318
SMILES: COc1ccc(cc1CN1CCc2cc(OC)c(OC)cc2C1C)C1NCCc2c1[nH]c1ccccc21
InChI Key: InChIKey=FAHCSUHPPAUHAJ-UHFFFAOYSA-N
Data: 2 EC50
Activity Spreadsheet -- Enzyme Inhibition Constant Data from BindingDB
Found 2 hits for monomerid = 51853
Trg + Lig
Ki
nM
ΔG°
kcal/mole
IC50
nM
Kd
nM
EC50/IC50
nM
koff
s-1
kon
M-1s-1
pHTemp
°C
Mitogen-activated protein kinase kinase kinase kinase 2
(Homo sapiens (Human))
BDBM51853
(1-[3-[(6,7-dimethoxy-1-methyl-3,4-dihydro-1H-isoqu...)
Show SMILES COc1ccc(cc1CN1CCc2cc(OC)c(OC)cc2C1C)C1NCCc2c1[nH]c1ccccc21
Show InChI InChI=1S/C31H35N3O3/c1-19-25-17-29(37-4)28(36-3)16-20(25)12-14-34(19)18-22-15-21(9-10-27(22)35-2)30-31-24(11-13-32-30)23-7-5-6-8-26(23)33-31/h5-10,15-17,19,30,32-33H,11-14,18H2,1-4H3
Reactome pathway
PCBioAssay
n/an/an/an/a 1.05E+4n/an/an/an/a
NMMLSC
Curated by PubChem BioAssay
Assay Description
University of New Mexico Assay Overview: Assay Support: 1R03MH084830-01 Project Title: TR-FRET HTS Assay for Inhibitors of MEKK2-MEK5 PB1 Domain...
PubChem Bioassay (2009)
BindingDB Entry DOI: 10.7270/Q21Z42TP
Mitogen-activated protein kinase kinase kinase kinase 2
(Homo sapiens (Human))
BDBM51853
(1-[3-[(6,7-dimethoxy-1-methyl-3,4-dihydro-1H-isoqu...)
Show SMILES COc1ccc(cc1CN1CCc2cc(OC)c(OC)cc2C1C)C1NCCc2c1[nH]c1ccccc21
Show InChI InChI=1S/C31H35N3O3/c1-19-25-17-29(37-4)28(36-3)16-20(25)12-14-34(19)18-22-15-21(9-10-27(22)35-2)30-31-24(11-13-32-30)23-7-5-6-8-26(23)33-31/h5-10,15-17,19,30,32-33H,11-14,18H2,1-4H3
Reactome pathway
PCBioAssay
n/an/an/an/a 1.32E+4n/an/an/an/a
NMMLSC
Curated by PubChem BioAssay
Assay Description
University of New Mexico Assay Overview: Assay Support: 1R03MH084830-01 Project Title: TR-FRET HTS Assay for Inhibitors of MEKK2-MEK5 PB1 Domain...
PubChem Bioassay (2009)
BindingDB Entry DOI: 10.7270/Q25Q4THK