BDBM51894 4-amyl-8-[1-(1,3-benzodioxol-5-yl)-3-piperidino-propyl]-5,7-dimethoxy-coumarin::8-[1-(1,3-benzodioxol-5-yl)-3-(1-piperidinyl)propyl]-5,7-dimethoxy-4-pentyl-1-benzopyran-2-one::8-[1-(1,3-benzodioxol-5-yl)-3-piperidin-1-yl-propyl]-5,7-dimethoxy-4-pentyl-chromen-2-one::8-[1-(1,3-benzodioxol-5-yl)-3-piperidin-1-ylpropyl]-5,7-dimethoxy-4-pentylchromen-2-one::MLS000879377::SMR000465603::cid_16746261
SMILES: CCCCCc1cc(=O)oc2c(C(CCN3CCCCC3)c3ccc4OCOc4c3)c(OC)cc(OC)c12
InChI Key: InChIKey=QVXVWLQXQKIEKW-UHFFFAOYSA-N
Data: 2 EC50
Activity Spreadsheet -- Enzyme Inhibition Constant Data from BindingDB
Found 2 hits for monomerid = 51894
Trg + Lig
Ki
nM
ΔG°
kcal/mole
IC50
nM
Kd
nM
EC50/IC50
nM
koff
s-1
kon
M-1s-1
pHTemp
°C
Mitogen-activated protein kinase kinase kinase kinase 2
(Homo sapiens (Human))
BDBM51894
(4-amyl-8-[1-(1,3-benzodioxol-5-yl)-3-piperidino-pr...)
Show SMILES CCCCCc1cc(=O)oc2c(C(CCN3CCCCC3)c3ccc4OCOc4c3)c(OC)cc(OC)c12
Show InChI InChI=1S/C31H39NO6/c1-4-5-7-10-22-18-28(33)38-31-29(22)26(34-2)19-27(35-3)30(31)23(13-16-32-14-8-6-9-15-32)21-11-12-24-25(17-21)37-20-36-24/h11-12,17-19,23H,4-10,13-16,20H2,1-3H3
Reactome pathway
PCBioAssay
n/an/an/an/a 3.00E+4n/an/an/an/a
NMMLSC
Curated by PubChem BioAssay
Assay Description
University of New Mexico Assay Overview: Assay Support: 1R03MH084830-01 Project Title: TR-FRET HTS Assay for Inhibitors of MEKK2-MEK5 PB1 Domain...
PubChem Bioassay (2009)
BindingDB Entry DOI: 10.7270/Q21Z42TP
Mitogen-activated protein kinase kinase kinase kinase 2
(Homo sapiens (Human))
BDBM51894
(4-amyl-8-[1-(1,3-benzodioxol-5-yl)-3-piperidino-pr...)
Show SMILES CCCCCc1cc(=O)oc2c(C(CCN3CCCCC3)c3ccc4OCOc4c3)c(OC)cc(OC)c12
Show InChI InChI=1S/C31H39NO6/c1-4-5-7-10-22-18-28(33)38-31-29(22)26(34-2)19-27(35-3)30(31)23(13-16-32-14-8-6-9-15-32)21-11-12-24-25(17-21)37-20-36-24/h11-12,17-19,23H,4-10,13-16,20H2,1-3H3
Reactome pathway
PCBioAssay
n/an/an/an/a 3.00E+4n/an/an/an/a
NMMLSC
Curated by PubChem BioAssay
Assay Description
University of New Mexico Assay Overview: Assay Support: 1R03MH084830-01 Project Title: TR-FRET HTS Assay for Inhibitors of MEKK2-MEK5 PB1 Domain...
PubChem Bioassay (2009)
BindingDB Entry DOI: 10.7270/Q25Q4THK