BDBM51948 (4Z)-4-[(4-fluorophenyl)-hydroxy-methylene]-5-(2-pyridyl)-1-(3-pyridylmethyl)pyrrolidine-2,3-quinone::(4Z)-4-[(4-fluorophenyl)-hydroxymethylidene]-5-(2-pyridinyl)-1-(3-pyridinylmethyl)pyrrolidine-2,3-dione::(4Z)-4-[(4-fluorophenyl)-hydroxymethylidene]-5-pyridin-2-yl-1-(pyridin-3-ylmethyl)pyrrolidine-2,3-dione::(4Z)-4-[(4-fluorophenyl)-oxidanyl-methylidene]-5-pyridin-2-yl-1-(pyridin-3-ylmethyl)pyrrolidine-2,3-dione::MLS000037253::SMR000042455::cid_5389373
SMILES: Fc1ccc(cc1)C(=O)C1C(N(Cc2cccnc2)C(=O)C1=O)c1ccccn1
InChI Key: InChIKey=BVVSGRPOAWXFIQ-UHFFFAOYSA-N
Data: 4 IC50
Activity Spreadsheet -- Enzyme Inhibition Constant Data from BindingDB
Found 4 hits for monomerid = 51948
Trg + Lig
Ki
nM
ΔG°
kcal/mole
IC50
nM
Kd
nM
EC50/IC50
nM
koff
s-1
kon
M-1s-1
pHTemp
°C
Beta lactamase
(Pseudomonas aeruginosa)
BDBM51948
((4Z)-4-[(4-fluorophenyl)-hydroxy-methylene]-5-(2-p...)
Show SMILES Fc1ccc(cc1)C(=O)C1C(N(Cc2cccnc2)C(=O)C1=O)c1ccccn1
Show InChI InChI=1S/C22H16FN3O3/c23-16-8-6-15(7-9-16)20(27)18-19(17-5-1-2-11-25-17)26(22(29)21(18)28)13-14-4-3-10-24-12-14/h1-12,18-19H,13H2
PCBioAssay
n/an/a 2.42E+3n/an/an/an/an/an/a
The Scripps Research Institute Molecular Screening Center
Curated by PubChem BioAssay
Assay Description
Source (MLPCN Center Name): The Scripps Research Institute Molecular Screening Center (SRIMSC) Center Affiliation: The Scripps Research Institute (TS...
PubChem Bioassay (2009)
BindingDB Entry DOI: 10.7270/Q2X63KBQ
metallo-beta-lactamase IMP-1
(Pseudomonas aeruginosa)
BDBM51948
((4Z)-4-[(4-fluorophenyl)-hydroxy-methylene]-5-(2-p...)
Show SMILES Fc1ccc(cc1)C(=O)C1C(N(Cc2cccnc2)C(=O)C1=O)c1ccccn1
Show InChI InChI=1S/C22H16FN3O3/c23-16-8-6-15(7-9-16)20(27)18-19(17-5-1-2-11-25-17)26(22(29)21(18)28)13-14-4-3-10-24-12-14/h1-12,18-19H,13H2
PCBioAssay
n/an/a 5.96E+4n/an/an/an/an/an/a
The Scripps Research Institute Molecular Screening Center
Curated by PubChem BioAssay
Assay Description
Source (MLPCN Center Name): The Scripps Research Institute Molecular Screening Center (SRIMSC) Center Affiliation: The Scripps Research Institute (TS...
PubChem Bioassay (2009)
BindingDB Entry DOI: 10.7270/Q2J101MD
Beta lactamase
(Pseudomonas aeruginosa)
BDBM51948
((4Z)-4-[(4-fluorophenyl)-hydroxy-methylene]-5-(2-p...)
Show SMILES Fc1ccc(cc1)C(=O)C1C(N(Cc2cccnc2)C(=O)C1=O)c1ccccn1
Show InChI InChI=1S/C22H16FN3O3/c23-16-8-6-15(7-9-16)20(27)18-19(17-5-1-2-11-25-17)26(22(29)21(18)28)13-14-4-3-10-24-12-14/h1-12,18-19H,13H2
PCBioAssay
n/an/a 941n/an/an/an/an/an/a
The Scripps Research Institute Molecular Screening Center
Curated by PubChem BioAssay
Assay Description
Source (MLPCN Center Name): The Scripps Research Institute Molecular Screening Center (SRIMSC) Center Affiliation: The Scripps Research Institute (TS...
PubChem Bioassay (2009)
BindingDB Entry DOI: 10.7270/Q2NS0S90
metallo-beta-lactamase IMP-1
(Pseudomonas aeruginosa)
BDBM51948
((4Z)-4-[(4-fluorophenyl)-hydroxy-methylene]-5-(2-p...)
Show SMILES Fc1ccc(cc1)C(=O)C1C(N(Cc2cccnc2)C(=O)C1=O)c1ccccn1
Show InChI InChI=1S/C22H16FN3O3/c23-16-8-6-15(7-9-16)20(27)18-19(17-5-1-2-11-25-17)26(22(29)21(18)28)13-14-4-3-10-24-12-14/h1-12,18-19H,13H2
PCBioAssay
n/an/a 5.96E+4n/an/an/an/an/an/a
The Scripps Research Institute Molecular Screening Center
Curated by PubChem BioAssay
Assay Description
Source (MLPCN Center Name): The Scripps Research Institute Molecular Screening Center (SRIMSC) Center Affiliation: The Scripps Research Institute (TS...
PubChem Bioassay (2009)
BindingDB Entry DOI: 10.7270/Q2SF2TM0