null
SMILES: FC(F)(F)C(Cn1c(nn(Cc2ncn(n2)-c2ncccc2Cl)c1=O)-c1ccc(Cl)cc1)NC(=O)C1CC1(F)F
InChI Key:
Activity Spreadsheet -- Enzyme Inhibition Constant Data from BindingDB
Found 2 hits for monomerid = 521113
Trg + Lig
Ki
nM
ΔG°
kcal/mole
IC50
nM
Kd
nM
EC50/IC50
nM
koff
s-1
kon
M-1s-1
pHTemp
°C
Vasopressin V2 receptor
(Homo sapiens (Human))
BDBM521113
(N-{3-[3-(4-Chlorophenyl)-1-{[1-(3-chloropyridin-2-...)
Show SMILES FC(F)(F)C(Cn1c(nn(Cc2ncn(n2)-c2ncccc2Cl)c1=O)-c1ccc(Cl)cc1)NC(=O)C1CC1(F)F
n/an/a 130n/an/an/an/an/an/a
TBA
Citation and Details
BindingDB Entry DOI: 10.7270/Q2SQ93JT
Vasopressin V1a receptor
(Homo sapiens (Human))
BDBM521113
(N-{3-[3-(4-Chlorophenyl)-1-{[1-(3-chloropyridin-2-...)
Show SMILES FC(F)(F)C(Cn1c(nn(Cc2ncn(n2)-c2ncccc2Cl)c1=O)-c1ccc(Cl)cc1)NC(=O)C1CC1(F)F
n/an/a 1.65n/an/an/an/an/an/a
TBA
Citation and Details
BindingDB Entry DOI: 10.7270/Q2SQ93JT