null
SMILES: FC(F)(F)[C@@H](Cn1c(nn(Cc2ncn(n2)-c2ncccc2Cl)c1=O)-c1ccc(Cl)cc1)NC(=O)C1CS(=O)(=O)C1
InChI Key:
Activity Spreadsheet -- Enzyme Inhibition Constant Data from BindingDB
Found 2 hits for monomerid = 521144
Trg + Lig
Ki
nM
ΔG°
kcal/mole
IC50
nM
Kd
nM
EC50/IC50
nM
koff
s-1
kon
M-1s-1
pHTemp
°C
Vasopressin V2 receptor
(Homo sapiens (Human))
BDBM521144
(US11149023, Example 39)
Show SMILES FC(F)(F)[C@@H](Cn1c(nn(Cc2ncn(n2)-c2ncccc2Cl)c1=O)-c1ccc(Cl)cc1)NC(=O)C1CS(=O)(=O)C1 |r|
n/an/a 53.2n/an/an/an/an/an/a
TBA
Citation and Details
Vasopressin V1a receptor
(Homo sapiens (Human))
BDBM521144
(US11149023, Example 39)
Show SMILES FC(F)(F)[C@@H](Cn1c(nn(Cc2ncn(n2)-c2ncccc2Cl)c1=O)-c1ccc(Cl)cc1)NC(=O)C1CS(=O)(=O)C1 |r|
n/an/a 0.480n/an/an/an/an/an/a
TBA
Citation and Details