null
SMILES: CS(=O)(=O)CC(=O)N[C@@H](Cn1c(nn(Cc2ncn(n2)-c2ncccc2Cl)c1=O)-c1ccc(Cl)cc1)C(F)(F)F
InChI Key:
Activity Spreadsheet -- Enzyme Inhibition Constant Data from BindingDB
Found 2 hits for monomerid = 521151
Trg + Lig
Ki
nM
ΔG°
kcal/mole
IC50
nM
Kd
nM
EC50/IC50
nM
koff
s-1
kon
M-1s-1
pHTemp
°C
Vasopressin V2 receptor
(Homo sapiens (Human))
BDBM521151
(US11149023, Example 46)
Show SMILES CS(=O)(=O)CC(=O)N[C@@H](Cn1c(nn(Cc2ncn(n2)-c2ncccc2Cl)c1=O)-c1ccc(Cl)cc1)C(F)(F)F |r|
n/an/a 57.8n/an/an/an/an/an/a
TBA
Citation and Details
Vasopressin V1a receptor
(Homo sapiens (Human))
BDBM521151
(US11149023, Example 46)
Show SMILES CS(=O)(=O)CC(=O)N[C@@H](Cn1c(nn(Cc2ncn(n2)-c2ncccc2Cl)c1=O)-c1ccc(Cl)cc1)C(F)(F)F |r|
n/an/a 1.35n/an/an/an/an/an/a
TBA
Citation and Details