BDBM52471 2-(1-adamantyl)-N-(1-iminoisoindolin-2-yl)acetamide::2-(1-adamantyl)-N-(3-azanylidene-1H-isoindol-2-yl)ethanamide::2-(1-adamantyl)-N-(3-imino-1H-isoindol-2-yl)acetamide::MLS000402247::SMR000263874::cid_4308688
SMILES: [H]C12CC3([H])CC([H])(C1)CC(CC(=O)NN1Cc4ccccc4C1=N)(C2)C3
InChI Key: InChIKey=HJRRHPQXXWIXOM-UHFFFAOYSA-N
Data: 2 EC50
Activity Spreadsheet -- Enzyme Inhibition Constant Data from BindingDB
Found 2 hits for monomerid = 52471
Trg + Lig
Ki
nM
ΔG°
kcal/mole
IC50
nM
Kd
nM
EC50/IC50
nM
koff
s-1
kon
M-1s-1
pHTemp
°C
Zinc finger protein mex-5
(Caenorhabditis elegans)
BDBM52471
(2-(1-adamantyl)-N-(1-iminoisoindolin-2-yl)acetamid...)
Show SMILES [H]C12CC3([H])CC([H])(C1)CC(CC(=O)NN1Cc4ccccc4C1=N)(C2)C3 |TLB:8:6:26:1.25.2,8:1:26:6.9.5,THB:2:1:9:3.26.5|
Show InChI InChI=1S/C20H25N3O/c21-19-17-4-2-1-3-16(17)12-23(19)22-18(24)11-20-8-13-5-14(9-20)7-15(6-13)10-20/h1-4,13-15,21H,5-12H2,(H,22,24)
PCBioAssay
n/an/an/an/a 3.00E+5n/an/an/an/a
Broad Institute
Curated by PubChem BioAssay
Assay Description
Broad Institute: MLPCN maternal gene expression Project ID: 2024 Keywords: Zinc finger, C. elegans, maternal gene expression, RNA-protein interac...
PubChem Bioassay (2009)
BindingDB Entry DOI: 10.7270/Q2D798VP
POsterior Segregation
(Caenorhabditis elegans)
BDBM52471
(2-(1-adamantyl)-N-(1-iminoisoindolin-2-yl)acetamid...)
Show SMILES [H]C12CC3([H])CC([H])(C1)CC(CC(=O)NN1Cc4ccccc4C1=N)(C2)C3 |TLB:8:6:26:1.25.2,8:1:26:6.9.5,THB:2:1:9:3.26.5|
Show InChI InChI=1S/C20H25N3O/c21-19-17-4-2-1-3-16(17)12-23(19)22-18(24)11-20-8-13-5-14(9-20)7-15(6-13)10-20/h1-4,13-15,21H,5-12H2,(H,22,24)
PCBioAssay
n/an/an/an/a 3.00E+5n/an/an/an/a
Broad Institute
Curated by PubChem BioAssay
Assay Description
Broad Institute: MLPCN maternal gene expression Project ID: 2024 Keywords: Zinc finger, C. elegans, maternal gene expression, RNA-protein interac...
PubChem Bioassay (2009)
BindingDB Entry DOI: 10.7270/Q28G8J4C