null
SMILES: CS(=O)(=O)N1CCN(Cc2ccnc(Nc3ncc(s3)-c3ccccc3)c2)CC1
InChI Key: InChIKey=YFVAGXCBQNGTOV-UHFFFAOYSA-N
Activity Spreadsheet -- Enzyme Inhibition Constant Data from BindingDB
Found 1 hit for monomerid = 5284
Trg + Lig
Ki
nM
ΔG°
kcal/mole
IC50
nM
Kd
nM
EC50/IC50
nM
koff
s-1
kon
M-1s-1
pHTemp
°C
Vascular endothelial growth factor receptor 2
(Homo sapiens (Human))
BDBM5284
(4-{[4-(Methylsulfonyl)piperazin-1-yl]methyl}-N-(5-...)
Show SMILES CS(=O)(=O)N1CCN(Cc2ccnc(Nc3ncc(s3)-c3ccccc3)c2)CC1
Show InChI InChI=1S/C20H23N5O2S2/c1-29(26,27)25-11-9-24(10-12-25)15-16-7-8-21-19(13-16)23-20-22-14-18(28-20)17-5-3-2-4-6-17/h2-8,13-14H,9-12,15H2,1H3,(H,21,22,23)
NCI pathway
Reactome pathway
n/an/a 2n/an/an/an/a7.422
Merck Research Laboratories
Assay Description
Activated KDR was incubated with 25 uM/10 uCi of [gamma-33P] ATP, poly-Glu/Tyr, and inhibitors in kinase buffer for 15 min at 22 °C. The reactio...
J Med Chem 47: 6363-72 (2004)
Article DOI: 10.1021/jm049697f
BindingDB Entry DOI: 10.7270/Q2PG1PXD