null
SMILES: COc1ccc(c(n1)S(=O)c1ccc(Cl)cc1)[N+]([O-])=O
InChI Key:
Activity Spreadsheet -- Enzyme Inhibition Constant Data from BindingDB
Found 2 hits for monomerid = 531217
Trg + Lig
Ki
nM
ΔG°
kcal/mole
IC50
nM
Kd
nM
EC50/IC50
nM
koff
s-1
kon
M-1s-1
pHTemp
°C
Glutathione reductase, mitochondrial
(Homo sapiens (Human))
BDBM531217
(US11208384, Example 1)
Show SMILES COc1ccc(c(n1)S(=O)c1ccc(Cl)cc1)[N+]([O-])=O
n/an/a 4.13E+4n/an/an/an/an/an/a
TBA
Citation and Details
Thioredoxin reductase 1, cytoplasmic
(Homo sapiens (Human))
BDBM531217
(US11208384, Example 1)
Show SMILES COc1ccc(c(n1)S(=O)c1ccc(Cl)cc1)[N+]([O-])=O
n/an/a 3.16n/an/an/an/an/an/a
TBA
Citation and Details