BDBM53218 2-[6-(5-amino-1H-benzimidazol-2-yl)pyridin-2-yl]-1H-benzimidazol-5-amine::2-[6-(6-amino-1H-benzimidazol-2-yl)-2-pyridinyl]-3H-benzimidazol-5-amine::2-[6-(6-amino-1H-benzimidazol-2-yl)pyridin-2-yl]-3H-benzimidazol-5-amine::2-[6-(6-azanyl-1H-benzimidazol-2-yl)pyridin-2-yl]-3H-benzimidazol-5-amine::MLS001198633::SMR000558970::[2-[6-(6-amino-1H-benzimidazol-2-yl)-2-pyridyl]-3H-benzimidazol-5-yl]amine::cid_22332182
SMILES: Nc1ccc2nc([nH]c2c1)-c1cccc(n1)-c1nc2ccc(N)cc2[nH]1
InChI Key: InChIKey=MRLDMASHZJNTTF-UHFFFAOYSA-N
Data: 3 IC50  2 EC50
Activity Spreadsheet -- Enzyme Inhibition Constant Data from BindingDB
Found 5 hits for monomerid = 53218
Trg + Lig
Ki
nM
ΔG°
kcal/mole
IC50
nM
Kd
nM
EC50/IC50
nM
koff
s-1
kon
M-1s-1
pHTemp
°C
POsterior Segregation family member (pos-1)
(Caenorhabditis elegans)
BDBM53218
(2-[6-(5-amino-1H-benzimidazol-2-yl)pyridin-2-yl]-1...)
Show SMILES Nc1ccc2nc([nH]c2c1)-c1cccc(n1)-c1nc2ccc(N)cc2[nH]1
Show InChI InChI=1S/C19H15N7/c20-10-4-6-12-16(8-10)25-18(23-12)14-2-1-3-15(22-14)19-24-13-7-5-11(21)9-17(13)26-19/h1-9H,20-21H2,(H,23,25)(H,24,26)
PCBioAssay
n/an/an/an/a 3.00E+5n/an/an/an/a
Broad Institute
Curated by PubChem BioAssay
Assay Description
Broad Institute: MLPCN maternal gene expression Project ID: 2024 Keywords: Zinc finger, C. elegans, maternal gene expression, RNA-protein interac...
PubChem Bioassay (2009)
BindingDB Entry DOI: 10.7270/Q28G8J4C
RecName: Full=Zinc finger protein mex-5
(Caenorhabditis elegans)
BDBM53218
(2-[6-(5-amino-1H-benzimidazol-2-yl)pyridin-2-yl]-1...)
Show SMILES Nc1ccc2nc([nH]c2c1)-c1cccc(n1)-c1nc2ccc(N)cc2[nH]1
Show InChI InChI=1S/C19H15N7/c20-10-4-6-12-16(8-10)25-18(23-12)14-2-1-3-15(22-14)19-24-13-7-5-11(21)9-17(13)26-19/h1-9H,20-21H2,(H,23,25)(H,24,26)
PCBioAssay
n/an/an/an/a 3.00E+5n/an/an/an/a
Broad Institute
Curated by PubChem BioAssay
Assay Description
Broad Institute: MLPCN maternal gene expression Project ID: 2024 Keywords: Zinc finger, C. elegans, maternal gene expression, RNA-protein interac...
PubChem Bioassay (2009)
BindingDB Entry DOI: 10.7270/Q2D798VP
ubiquitin-conjugating enzyme E2 N
(Homo sapiens (Human))
BDBM53218
(2-[6-(5-amino-1H-benzimidazol-2-yl)pyridin-2-yl]-1...)
Show SMILES Nc1ccc2nc([nH]c2c1)-c1cccc(n1)-c1nc2ccc(N)cc2[nH]1
Show InChI InChI=1S/C19H15N7/c20-10-4-6-12-16(8-10)25-18(23-12)14-2-1-3-15(22-14)19-24-13-7-5-11(21)9-17(13)26-19/h1-9H,20-21H2,(H,23,25)(H,24,26)
Reactome pathway
PCBioAssay
n/an/a 8.28E+3n/an/an/an/an/an/a
Burnham Center for Chemical Genomics
Curated by PubChem BioAssay
Assay Description
Data Source: Sanford-Burnham Center for Chemical Genomics (SBCCG) Source Affiliation: Sanford-Burnham Medical Research Institute (SBMRI, San Diego CA...
PubChem Bioassay (2011)
BindingDB Entry DOI: 10.7270/Q2SB4462
ubiquitin-conjugating enzyme E2 N
(Homo sapiens (Human))
BDBM53218
(2-[6-(5-amino-1H-benzimidazol-2-yl)pyridin-2-yl]-1...)
Show SMILES Nc1ccc2nc([nH]c2c1)-c1cccc(n1)-c1nc2ccc(N)cc2[nH]1
Show InChI InChI=1S/C19H15N7/c20-10-4-6-12-16(8-10)25-18(23-12)14-2-1-3-15(22-14)19-24-13-7-5-11(21)9-17(13)26-19/h1-9H,20-21H2,(H,23,25)(H,24,26)
Reactome pathway
PCBioAssay
n/an/a 9.00E+3n/an/an/an/an/an/a
Burnham Center for Chemical Genomics
Curated by PubChem BioAssay
Assay Description
Data Source: Sanford-Burnham Center for Chemical Genomics (SBCCG) Source Affiliation: Sanford-Burnham Medical Research Institute (SBMRI, San Diego CA...
PubChem Bioassay (2011)
BindingDB Entry DOI: 10.7270/Q2X34VX0
Bfl-1
(Mus musculus (Mouse))
BDBM53218
(2-[6-(5-amino-1H-benzimidazol-2-yl)pyridin-2-yl]-1...)
Show SMILES Nc1ccc2nc([nH]c2c1)-c1cccc(n1)-c1nc2ccc(N)cc2[nH]1
Show InChI InChI=1S/C19H15N7/c20-10-4-6-12-16(8-10)25-18(23-12)14-2-1-3-15(22-14)19-24-13-7-5-11(21)9-17(13)26-19/h1-9H,20-21H2,(H,23,25)(H,24,26)
PCBioAssay
n/an/a 5.82E+3n/an/an/an/an/an/a
Burnham Center for Chemical Genomics
Curated by PubChem BioAssay
Assay Description
Data Source: Sanford-Burnham Center for Chemical Genomics (SBCCG) Source Affiliation: Sanford-Burnham Medical Research Institute (SBMRI, San Diego CA...
PubChem Bioassay (2011)
BindingDB Entry DOI: 10.7270/Q25D8Q92