BDBM53342 (E)-3-(2-furanyl)-N-[2-oxo-2-[(2-oxo-3-indolyl)hydrazo]ethyl]-2-propenamide::(E)-3-(2-furyl)-N-[2-keto-2-[N'-(2-ketoindol-3-yl)hydrazino]ethyl]acrylamide::(E)-3-(furan-2-yl)-N-[2-oxidanylidene-2-[2-(2-oxidanylideneindol-3-yl)hydrazinyl]ethyl]prop-2-enamide::(E)-3-(furan-2-yl)-N-[2-oxo-2-[2-(2-oxoindol-3-yl)hydrazinyl]ethyl]prop-2-enamide::MLS001075666::SMR000646156::cid_5900936
SMILES: O=C(CNC(=O)\C=C\c1ccco1)NNC1=c2ccccc2=NC1=O
InChI Key: InChIKey=RSHYBIOABAZEJQ-BQYQJAHWSA-N
Data: 7 IC50  2 EC50
Activity Spreadsheet -- Enzyme Inhibition Constant Data from BindingDB
Found 9 hits for monomerid = 53342
Trg + Lig
Ki
nM
ΔG°
kcal/mole
IC50
nM
Kd
nM
EC50/IC50
nM
koff
s-1
kon
M-1s-1
pHTemp
°C
POsterior Segregation
(Caenorhabditis elegans)
BDBM53342
((E)-3-(2-furanyl)-N-[2-oxo-2-[(2-oxo-3-indolyl)hyd...)
Show SMILES O=C(CNC(=O)\C=C\c1ccco1)NNC1=c2ccccc2=NC1=O |c:16,23|
Show InChI InChI=1S/C17H14N4O4/c22-14(8-7-11-4-3-9-25-11)18-10-15(23)20-21-16-12-5-1-2-6-13(12)19-17(16)24/h1-9H,10H2,(H,18,22)(H,20,23)(H,19,21,24)/b8-7+
PCBioAssay
n/an/an/an/a 1.31E+4n/an/an/an/a
Broad Institute
Curated by PubChem BioAssay
Assay Description
Broad Institute: MLPCN maternal gene expression Project ID: 2024 Keywords: Zinc finger, C. elegans, maternal gene expression, RNA-protein interac...
PubChem Bioassay (2009)
BindingDB Entry DOI: 10.7270/Q28G8J4C
Zinc finger protein mex-5
(Caenorhabditis elegans)
BDBM53342
((E)-3-(2-furanyl)-N-[2-oxo-2-[(2-oxo-3-indolyl)hyd...)
Show SMILES O=C(CNC(=O)\C=C\c1ccco1)NNC1=c2ccccc2=NC1=O |c:16,23|
Show InChI InChI=1S/C17H14N4O4/c22-14(8-7-11-4-3-9-25-11)18-10-15(23)20-21-16-12-5-1-2-6-13(12)19-17(16)24/h1-9H,10H2,(H,18,22)(H,20,23)(H,19,21,24)/b8-7+
PCBioAssay
n/an/an/an/a 5.49E+3n/an/an/an/a
Broad Institute
Curated by PubChem BioAssay
Assay Description
Broad Institute: MLPCN maternal gene expression Project ID: 2024 Keywords: Zinc finger, C. elegans, maternal gene expression, RNA-protein interac...
PubChem Bioassay (2009)
BindingDB Entry DOI: 10.7270/Q2D798VP
Amyloid-beta A4 precursor protein-binding family A member 1
(Rattus norvegicus)
BDBM53342
((E)-3-(2-furanyl)-N-[2-oxo-2-[(2-oxo-3-indolyl)hyd...)
Show SMILES O=C(CNC(=O)\C=C\c1ccco1)NNC1=c2ccccc2=NC1=O |c:16,23|
Show InChI InChI=1S/C17H14N4O4/c22-14(8-7-11-4-3-9-25-11)18-10-15(23)20-21-16-12-5-1-2-6-13(12)19-17(16)24/h1-9H,10H2,(H,18,22)(H,20,23)(H,19,21,24)/b8-7+
PCBioAssay
n/an/a 4.97E+3n/an/an/an/an/an/a
Burnham Center for Chemical Genomics
Curated by PubChem BioAssay
Assay Description
Data Source: Sanford-Burnham Center for Chemical Genomics (SBCCG) Source Affiliation: Sanford-Burnham Medical Research Institute (SBMRI, San Diego, C...
PubChem Bioassay (2009)
BindingDB Entry DOI: 10.7270/Q20P0XFH
Voltage-dependent N-type calcium channel subunit alpha-1B
(Homo sapiens (Human))
BDBM53342
((E)-3-(2-furanyl)-N-[2-oxo-2-[(2-oxo-3-indolyl)hyd...)
Show SMILES O=C(CNC(=O)\C=C\c1ccco1)NNC1=c2ccccc2=NC1=O |c:16,23|
Show InChI InChI=1S/C17H14N4O4/c22-14(8-7-11-4-3-9-25-11)18-10-15(23)20-21-16-12-5-1-2-6-13(12)19-17(16)24/h1-9H,10H2,(H,18,22)(H,20,23)(H,19,21,24)/b8-7+
PCBioAssay
n/an/a 5.68E+4n/an/an/an/an/an/a
Burnham Center for Chemical Genomics
Curated by PubChem BioAssay
Assay Description
Data Source: Data Source: Sanford-Burnham Center for Chemical Genomics (SBCCG) Source Affiliation: Sanford-Burnham Medical Research Institute Network...
PubChem Bioassay (2009)
BindingDB Entry DOI: 10.7270/Q2PZ578V
DNA (cytosine-5)-methyltransferase 1
(Homo sapiens (Human))
BDBM53342
((E)-3-(2-furanyl)-N-[2-oxo-2-[(2-oxo-3-indolyl)hyd...)
Show SMILES O=C(CNC(=O)\C=C\c1ccco1)NNC1=c2ccccc2=NC1=O |c:16,23|
Show InChI InChI=1S/C17H14N4O4/c22-14(8-7-11-4-3-9-25-11)18-10-15(23)20-21-16-12-5-1-2-6-13(12)19-17(16)24/h1-9H,10H2,(H,18,22)(H,20,23)(H,19,21,24)/b8-7+
PCBioAssay
n/an/a 3.25E+3n/an/an/an/an/an/a
Burnham Center for Chemical Genomics
Curated by PubChem BioAssay
Assay Description
Data Source: Sanford-Burnham Center for Chemical Genomics (SBCCG) Source Affiliation: Sanford-Burnham Medical Research Institute (SBMRI, San Diego, C...
PubChem Bioassay (2012)
BindingDB Entry DOI: 10.7270/Q2NC5ZRN
Bcl-2-like protein 1
(Homo sapiens (Human))
BDBM53342
((E)-3-(2-furanyl)-N-[2-oxo-2-[(2-oxo-3-indolyl)hyd...)
Show SMILES O=C(CNC(=O)\C=C\c1ccco1)NNC1=c2ccccc2=NC1=O |c:16,23|
Show InChI InChI=1S/C17H14N4O4/c22-14(8-7-11-4-3-9-25-11)18-10-15(23)20-21-16-12-5-1-2-6-13(12)19-17(16)24/h1-9H,10H2,(H,18,22)(H,20,23)(H,19,21,24)/b8-7+
NCI pathway
Reactome pathway
PCBioAssay
n/an/a 3.71E+4n/an/an/an/an/an/a
The Scripps Research Institute Molecular Screening Center
Curated by PubChem BioAssay
Assay Description
Source (MLPCN Center Name): The Scripps Research Institute Molecular Screening Center Affiliation: The Scripps Research Institute, TSRI Assay Provide...
PubChem Bioassay (2009)
BindingDB Entry DOI: 10.7270/Q2DF6PNW
Hexokinase HKDC1 [W721R]
(Homo sapiens (Human))
BDBM53342
((E)-3-(2-furanyl)-N-[2-oxo-2-[(2-oxo-3-indolyl)hyd...)
Show SMILES O=C(CNC(=O)\C=C\c1ccco1)NNC1=c2ccccc2=NC1=O |c:16,23|
Show InChI InChI=1S/C17H14N4O4/c22-14(8-7-11-4-3-9-25-11)18-10-15(23)20-21-16-12-5-1-2-6-13(12)19-17(16)24/h1-9H,10H2,(H,18,22)(H,20,23)(H,19,21,24)/b8-7+
PCBioAssay
n/an/a 2.53E+4n/an/an/an/an/an/a
Burnham Center for Chemical Genomics
Curated by PubChem BioAssay
Assay Description
Data Source: Sanford-Burnham Center for Chemical Genomics (SBCCG) Source Affiliation: Sanford-Burnham Medical Research Institute (SBMRI, San Diego, C...
PubChem Bioassay (2011)
BindingDB Entry DOI: 10.7270/Q2W094D4
Hexokinase HKDC1 [W721R]
(Homo sapiens (Human))
BDBM53342
((E)-3-(2-furanyl)-N-[2-oxo-2-[(2-oxo-3-indolyl)hyd...)
Show SMILES O=C(CNC(=O)\C=C\c1ccco1)NNC1=c2ccccc2=NC1=O |c:16,23|
Show InChI InChI=1S/C17H14N4O4/c22-14(8-7-11-4-3-9-25-11)18-10-15(23)20-21-16-12-5-1-2-6-13(12)19-17(16)24/h1-9H,10H2,(H,18,22)(H,20,23)(H,19,21,24)/b8-7+
PCBioAssay
n/an/a 8.00E+4n/an/an/an/an/an/a
Burnham Center for Chemical Genomics
Curated by PubChem BioAssay
Assay Description
Data Source: Sanford-Burnham Center for Chemical Genomics (SBCCG) Source Affiliation: Sanford-Burnham Medical Research Institute (SBMRI, San Diego, C...
PubChem Bioassay (2011)
BindingDB Entry DOI: 10.7270/Q23F4N3R
Induced myeloid leukemia cell differentiation protein Mcl-1
(Homo sapiens (Human))
BDBM53342
((E)-3-(2-furanyl)-N-[2-oxo-2-[(2-oxo-3-indolyl)hyd...)
Show SMILES O=C(CNC(=O)\C=C\c1ccco1)NNC1=c2ccccc2=NC1=O |c:16,23|
Show InChI InChI=1S/C17H14N4O4/c22-14(8-7-11-4-3-9-25-11)18-10-15(23)20-21-16-12-5-1-2-6-13(12)19-17(16)24/h1-9H,10H2,(H,18,22)(H,20,23)(H,19,21,24)/b8-7+
NCI pathway
PCBioAssay
n/an/a 9.70E+3n/an/an/an/an/an/a
The Scripps Research Institute Molecular Screening Center
Curated by PubChem BioAssay
Assay Description
Source (MLPCN Center Name): The Scripps Research Institute Molecular Screening Center Affiliation: The Scripps Research Institute, TSRI Assay Provide...
PubChem Bioassay (2009)
BindingDB Entry DOI: 10.7270/Q2J67FCM