BDBM5389 2,4-Disubstituted Pyrimidine 3a::N-[3-methyl-5-(trifluoromethyl)phenyl]-4-(2-phenyl-1H-imidazol-1-yl)pyrimidin-2-amine
SMILES: Cc1cc(Nc2nccc(n2)-n2ccnc2-c2ccccc2)cc(c1)C(F)(F)F
InChI Key: InChIKey=PSWWUMTWJRPKLC-UHFFFAOYSA-N
Data: 1 IC50
Activity Spreadsheet -- Enzyme Inhibition Constant Data from BindingDB
Found 1 hit for monomerid = 5389
Trg + Lig
Ki
nM
ΔG°
kcal/mole
IC50
nM
Kd
nM
EC50/IC50
nM
koff
s-1
kon
M-1s-1
pHTemp
°C
Vascular endothelial growth factor receptor 2
(Homo sapiens (Human))
BDBM5389
(2,4-Disubstituted Pyrimidine 3a | N-[3-methyl-5-(t...)
Show SMILES Cc1cc(Nc2nccc(n2)-n2ccnc2-c2ccccc2)cc(c1)C(F)(F)F
Show InChI InChI=1S/C21H16F3N5/c1-14-11-16(21(22,23)24)13-17(12-14)27-20-26-8-7-18(28-20)29-10-9-25-19(29)15-5-3-2-4-6-15/h2-13H,1H3,(H,26,27,28)
NCI pathway
Reactome pathway
n/an/a 5n/an/an/an/a7.422
Merck Research Laboratories
Assay Description
Activated KDR was incubated with 25 uM/10 uCi of [gamma-33P] ATP, poly-Glu/Tyr, and inhibitors in kinase buffer for 15 min at 22 °C. The reactio...
Bioorg Med Chem Lett 13: 1673-7 (2003)
Article DOI: 10.1016/s0960-894x(03)00244-0
BindingDB Entry DOI: 10.7270/Q2X0657G